cp lib/DBD/mysql.pm blib/lib/DBD/mysql.pm
cp lib/DBD/mysql/GetInfo.pm blib/lib/DBD/mysql/GetInfo.pm
cp lib/Mysql.pm blib/lib/Mysql.pm
cp lib/DBD/mysql/INSTALL.pod blib/lib/DBD/mysql/INSTALL.pod
cp lib/Mysql/Statement.pm blib/lib/Mysql/Statement.pm
cp lib/Bundle/DBD/mysql.pm blib/lib/Bundle/DBD/mysql.pm
cc -c -I/usr/lib/perl5/site_perl/5.8.7/i486-linux/auto/DBI -I/services/mysqld/include -mcpu=pentiumpro -DDBD_MYSQL_INSERT_ID_IS_GOOD -g -fno-strict-aliasing -pipe -I/usr/local/include -D_LARGEFILc
/usr/bin/perl5.8.7 -p -e "s/~DRIVER~/mysql/g" /usr/lib/perl5/site_perl/5.8.7/i486-linux/auto/DBI/Driver.xst > mysql.xsi
/usr/bin/perl5.8.7 /usr/lib/perl5/5.8.7/ExtUtils/xsubpp -typemap /usr/lib/perl5/5.8.7/ExtUtils/typemap mysql.xs > mysql.xsc && mv mysql.xsc mysql.c
Warning: duplicate function definition 'do' detected in mysql.xs, line 224
Warning: duplicate function definition 'rows' detected in mysql.xs, line 567
cc -c -I/usr/lib/perl5/site_perl/5.8.7/i486-linux/auto/DBI -I/services/mysqld/include -mcpu=pentiumpro -DDBD_MYSQL_INSERT_ID_IS_GOOD -g -fno-strict-aliasing -pipe -I/usr/local/include -D_LARGEFILc
Running Mkbootstrap for DBD::mysql ()
chmod 644 mysql.bs
rm -f blib/arch/auto/DBD/mysql/mysql.so
LD_RUN_PATH="/usr/lib:/lib" /usr/bin/perl5.8.7 myld cc -shared -L/usr/local/lib dbdimp.o mysql.o -o blib/arch/auto/DBD/mysql/mysql.so -L/usr/local/lib -L/services/mysqld/lib -lmysqlclient -lz -
chmod 755 blib/arch/auto/DBD/mysql/mysql.so
cp mysql.bs blib/arch/auto/DBD/mysql/mysql.bs
chmod 644 blib/arch/auto/DBD/mysql/mysql.bs
Manifying blib/man3/DBD::mysql.3
Manifying blib/man3/DBD::mysql::INSTALL.3
Manifying blib/man3/Mysql.3
Manifying blib/man3/Bundle::DBD::mysql.3
/usr/bin/make -- OK
Running make test
PERL_DL_NONLAZY=1 /usr/bin/perl5.8.7 "-MExtUtils::Command::MM" "-e" "test_harness(0, 'blib/lib', 'blib/arch')" t/*.t
t/00base.............install_driver(mysql) failed: Can't load '/root/.cpan/build/DBD-mysql-3.0006/blib/arch/auto/DBD/mysql/mysql.so' for module DBD::mysql: /root/.cpan/build/DBD-mysql-3.0006/blib/a.
at (eval 3) line 3
Compilation failed in require at (eval 3) line 3.
Perhaps a required shared library or dll isn't installed where expected
at t/00base.t line 38
t/00base.............dubious
Test returned status 2 (wstat 512, 0x200)
DIED. FAILED tests 4-5
Failed 2/5 tests, 60.00% okay
t/10dsnlist..........install_driver(mysql) failed: Can't load '/root/.cpan/build/DBD-mysql-3.0006/blib/arch/auto/DBD/mysql/mysql.so' for module DBD::mysql: /root/.cpan/build/DBD-mysql-3.0006/blib/a.
at (eval 3) line 3
Compilation failed in require at (eval 3) line 3.
Perhaps a required shared library or dll isn't installed where expected
at t/10dsnlist.t line 45
t/10dsnlist..........dubious
Test returned status 2 (wstat 512, 0x200)
DIED. FAILED tests 1-9
Failed 9/9 tests, 0.00% okay
t/20createdrop.......install_driver(mysql) failed: Can't load '/root/.cpan/build/DBD-mysql-3.0006/blib/arch/auto/DBD/mysql/mysql.so' for module DBD::mysql: /root/.cpan/build/DBD-mysql-3.0006/blib/a.
at (eval 3) line 3
Compilation failed in require at (eval 3) line 3.
Perhaps a required shared library or dll isn't installed where expected
at t/20createdrop.t line 45
t/20createdrop.......dubious
Test returned status 2 (wstat 512, 0x200)
DIED. FAILED tests 1-5
Failed 5/5 tests, 0.00% okay
t/30insertfetch......install_driver(mysql) failed: Can't load '/root/.cpan/build/DBD-mysql-3.0006/blib/arch/auto/DBD/mysql/mysql.so' for module DBD::mysql: /root/.cpan/build/DBD-mysql-3.0006/blib/a.
at (eval 3) line 3
Compilation failed in require at (eval 3) line 3.
Perhaps a required shared library or dll isn't installed where expected
at t/30insertfetch.t line 48
t/30insertfetch......dubious
Test returned status 2 (wstat 512, 0x200)
DIED. FAILED tests 1-11
Failed 11/11 tests, 0.00% okay
t/35limit............install_driver(mysql) failed: Can't load '/root/.cpan/build/DBD-mysql-3.0006/blib/arch/auto/DBD/mysql/mysql.so' for module DBD::mysql: /root/.cpan/build/DBD-mysql-3.0006/blib/a.
at (eval 3) line 3
Compilation failed in require at (eval 3) line 3.
Perhaps a required shared library or dll isn't installed where expected
at t/35limit.t line 50
t/35limit............dubious
Test returned status 2 (wstat 512, 0x200)
DIED. FAILED tests 1-113
Failed 113/113 tests, 0.00% okay
t/35prepare..........install_driver(mysql) failed: Can't load '/root/.cpan/build/DBD-mysql-3.0006/blib/arch/auto/DBD/mysql/mysql.so' for module DBD::mysql: /root/.cpan/build/DBD-mysql-3.0006/blib/a.
at (eval 3) line 3
Compilation failed in require at (eval 3) line 3.
Perhaps a required shared library or dll isn't installed where expected
at t/35prepare.t line 37
t/35prepare..........dubious
Test returned status 2 (wstat 512, 0x200)
DIED. FAILED tests 1-34
Failed 34/34 tests, 0.00% okay
t/40bindparam........install_driver(mysql) failed: Can't load '/root/.cpan/build/DBD-mysql-3.0006/blib/arch/auto/DBD/mysql/mysql.so' for module DBD::mysql: /root/.cpan/build/DBD-mysql-3.0006/blib/a.
at (eval 5) line 3
Compilation failed in require at (eval 5) line 3.
Perhaps a required shared library or dll isn't installed where expected
at t/40bindparam.t line 64
t/40bindparam........dubious
Test returned status 2 (wstat 512, 0x200)
DIED. FAILED tests 1-28
Failed 28/28 tests, 0.00% okay
t/40blobs............install_driver(mysql) failed: Can't load '/root/.cpan/build/DBD-mysql-3.0006/blib/arch/auto/DBD/mysql/mysql.so' for module DBD::mysql: /root/.cpan/build/DBD-mysql-3.0006/blib/a.
at (eval 3) line 3
Compilation failed in require at (eval 3) line 3.
Perhaps a required shared library or dll isn't installed where expected
at t/40blobs.t line 68
t/40blobs............dubious
Test returned status 2 (wstat 512, 0x200)
DIED. FAILED tests 1-11
Failed 11/11 tests, 0.00% okay
t/40listfields.......install_driver(mysql) failed: Can't load '/root/.cpan/build/DBD-mysql-3.0006/blib/arch/auto/DBD/mysql/mysql.so' for module DBD::mysql: /root/.cpan/build/DBD-mysql-3.0006/blib/a.
at (eval 3) line 3
Compilation failed in require at (eval 3) line 3.
Perhaps a required shared library or dll isn't installed where expected
at t/40listfields.t line 57
t/40listfields.......dubious
Test returned status 2 (wstat 512, 0x200)
DIED. FAILED tests 1-18
Failed 18/18 tests, 0.00% okay
t/40nulls............install_driver(mysql) failed: Can't load '/root/.cpan/build/DBD-mysql-3.0006/blib/arch/auto/DBD/mysql/mysql.so' for module DBD::mysql: /root/.cpan/build/DBD-mysql-3.0006/blib/a.
at (eval 3) line 3
Compilation failed in require at (eval 3) line 3.
Perhaps a required shared library or dll isn't installed where expected
at t/40nulls.t line 50
t/40nulls............dubious
Test returned status 2 (wstat 512, 0x200)
DIED. FAILED tests 1-11
Failed 11/11 tests, 0.00% okay
t/40numrows..........install_driver(mysql) failed: Can't load '/root/.cpan/build/DBD-mysql-3.0006/blib/arch/auto/DBD/mysql/mysql.so' for module DBD::mysql: /root/.cpan/build/DBD-mysql-3.0006/blib/a.
at (eval 3) line 3
Compilation failed in require at (eval 3) line 3.
Perhaps a required shared library or dll isn't installed where expected
at t/40numrows.t line 59
t/40numrows..........dubious
Test returned status 2 (wstat 512, 0x200)
DIED. FAILED tests 1-25
Failed 25/25 tests, 0.00% okay
t/41bindparam........install_driver(mysql) failed: Can't load '/root/.cpan/build/DBD-mysql-3.0006/blib/arch/auto/DBD/mysql/mysql.so' for module DBD::mysql: /root/.cpan/build/DBD-mysql-3.0006/blib/a.
at (eval 3) line 3
Compilation failed in require at (eval 3) line 3.
Perhaps a required shared library or dll isn't installed where expected
at t/41bindparam.t line 37
t/41bindparam........dubious
Test returned status 2 (wstat 512, 0x200)
DIED. FAILED tests 1-11
Failed 11/11 tests, 0.00% okay
t/41blobs_prepare....install_driver(mysql) failed: Can't load '/root/.cpan/build/DBD-mysql-3.0006/blib/arch/auto/DBD/mysql/mysql.so' for module DBD::mysql: /root/.cpan/build/DBD-mysql-3.0006/blib/a.
at (eval 3) line 3
Compilation failed in require at (eval 3) line 3.
Perhaps a required shared library or dll isn't installed where expected
at t/41blobs_prepare.t line 71
t/41blobs_prepare....dubious
Test returned status 2 (wstat 512, 0x200)
DIED. FAILED tests 1-24
Failed 24/24 tests, 0.00% okay
t/42bindparam........install_driver(mysql) failed: Can't load '/root/.cpan/build/DBD-mysql-3.0006/blib/arch/auto/DBD/mysql/mysql.so' for module DBD::mysql: /root/.cpan/build/DBD-mysql-3.0006/blib/a.
at (eval 3) line 3
Compilation failed in require at (eval 3) line 3.
Perhaps a required shared library or dll isn't installed where expected
at t/42bindparam.t line 37
t/42bindparam........dubious
Test returned status 2 (wstat 512, 0x200)
DIED. FAILED tests 1-11
Failed 11/11 tests, 0.00% okay
t/50chopblanks.......install_driver(mysql) failed: Can't load '/root/.cpan/build/DBD-mysql-3.0006/blib/arch/auto/DBD/mysql/mysql.so' for module DBD::mysql: /root/.cpan/build/DBD-mysql-3.0006/blib/a.
at (eval 3) line 3
Compilation failed in require at (eval 3) line 3.
Perhaps a required shared library or dll isn't installed where expected
at t/50chopblanks.t line 57
t/50chopblanks.......dubious
Test returned status 2 (wstat 512, 0x200)
DIED. FAILED tests 1-35
Failed 35/35 tests, 0.00% okay
t/50commit...........install_driver(mysql) failed: Can't load '/root/.cpan/build/DBD-mysql-3.0006/blib/arch/auto/DBD/mysql/mysql.so' for module DBD::mysql: /root/.cpan/build/DBD-mysql-3.0006/blib/a.
at (eval 3) line 3
Compilation failed in require at (eval 3) line 3.
Perhaps a required shared library or dll isn't installed where expected
at t/50commit.t line 64
t/50commit...........dubious
Test returned status 2 (wstat 512, 0x200)
DIED. FAILED tests 1-30
Failed 30/30 tests, 0.00% okay
t/60leaks............skipped
all skipped: $ENV{SLOW_TESTS} is not set or Proc::ProcessTable not installed
t/dbdadmin...........install_driver(mysql) failed: Can't load '/root/.cpan/build/DBD-mysql-3.0006/blib/arch/auto/DBD/mysql/mysql.so' for module DBD::mysql: /root/.cpan/build/DBD-mysql-3.0006/blib/a.
at (eval 3) line 3
Compilation failed in require at (eval 3) line 3.
Perhaps a required shared library or dll isn't installed where expected
at t/dbdadmin.t line 74
t/dbdadmin...........dubious
Test returned status 2 (wstat 512, 0x200)
DIED. FAILED tests 1-21
Failed 21/21 tests, 0.00% okay
t/insertid...........install_driver(mysql) failed: Can't load '/root/.cpan/build/DBD-mysql-3.0006/blib/arch/auto/DBD/mysql/mysql.so' for module DBD::mysql: /root/.cpan/build/DBD-mysql-3.0006/blib/a.
at (eval 3) line 3
Compilation failed in require at (eval 3) line 3.
Perhaps a required shared library or dll isn't installed where expected
at t/insertid.t line 13
t/insertid...........dubious
Test returned status 2 (wstat 512, 0x200)
DIED. FAILED tests 1-12
Failed 12/12 tests, 0.00% okay
t/param_values.......install_driver(mysql) failed: Can't load '/root/.cpan/build/DBD-mysql-3.0006/blib/arch/auto/DBD/mysql/mysql.so' for module DBD::mysql: /root/.cpan/build/DBD-mysql-3.0006/blib/a.
at (eval 3) line 3
Compilation failed in require at (eval 3) line 3.
Perhaps a required shared library or dll isn't installed where expected
at t/param_values.t line 16
t/param_values.......dubious
Test returned status 2 (wstat 512, 0x200)
DIED. FAILED tests 1-8
Failed 8/8 tests, 0.00% okay
t/prepare_noerror....install_driver(mysql) failed: Can't load '/root/.cpan/build/DBD-mysql-3.0006/blib/arch/auto/DBD/mysql/mysql.so' for module DBD::mysql: /root/.cpan/build/DBD-mysql-3.0006/blib/a.
at (eval 3) line 3
Compilation failed in require at (eval 3) line 3.
Perhaps a required shared library or dll isn't installed where expected
at t/prepare_noerror.t line 16
t/prepare_noerror....dubious
Test returned status 2 (wstat 512, 0x200)
DIED. FAILED tests 1-3
Failed 3/3 tests, 0.00% okay
t/texecute...........install_driver(mysql) failed: Can't load '/root/.cpan/build/DBD-mysql-3.0006/blib/arch/auto/DBD/mysql/mysql.so' for module DBD::mysql: /root/.cpan/build/DBD-mysql-3.0006/blib/a.
at (eval 3) line 3
Compilation failed in require at (eval 3) line 3.
Perhaps a required shared library or dll isn't installed where expected
at t/texecute.t line 17
t/texecute...........dubious
Test returned status 2 (wstat 512, 0x200)
DIED. FAILED tests 1-9
Failed 9/9 tests, 0.00% okay
Failed Test Stat Wstat Total Fail Failed List of Failed
-------------------------------------------------------------------------------
t/00base.t 2 512 5 4 80.00% 4-5
t/10dsnlist.t 2 512 9 18 200.00% 1-9
t/20createdrop.t 2 512 5 10 200.00% 1-5
t/30insertfetch.t 2 512 11 22 200.00% 1-11
t/35limit.t 2 512 113 226 200.00% 1-113
t/35prepare.t 2 512 34 68 200.00% 1-34
t/40bindparam.t 2 512 28 56 200.00% 1-28
t/40blobs.t 2 512 11 22 200.00% 1-11
t/40listfields.t 2 512 18 36 200.00% 1-18
t/40nulls.t 2 512 11 22 200.00% 1-11
t/40numrows.t 2 512 25 50 200.00% 1-25
t/41bindparam.t 2 512 11 22 200.00% 1-11
t/41blobs_prepare.t 2 512 24 48 200.00% 1-24
t/42bindparam.t 2 512 11 22 200.00% 1-11
t/50chopblanks.t 2 512 35 70 200.00% 1-35
t/50commit.t 2 512 30 60 200.00% 1-30
t/dbdadmin.t 2 512 21 42 200.00% 1-21
t/insertid.t 2 512 12 24 200.00% 1-12
t/param_values.t 2 512 8 16 200.00% 1-8
t/prepare_noerror.t 2 512 3 6 200.00% 1-3
t/texecute.t 2 512 9 18 200.00% 1-9
1 test skipped.
Failed 21/22 test scripts, 4.55% okay. 431/434 subtests failed, 0.69% okay.
make: *** [test_dynamic] Error 2
/usr/bin/make test -- NOT OK
Running make install
make test had returned bad status, won't install without force
Failed during this command:
CAPTTOFU/DBD-mysql-3.0006.tar.gz : make_test NO
cpan>