All pastes #964836 Raw Edit

Miscellany

public text v1 · immutable
#964836 ·published 2008-03-31 16:20 UTC
rendered paste body
NOTE: package webkit-gtk-0.1+svnr31457-r4: task do_compile: started
ERROR: function do_compile failed
ERROR: log data follows (/home/hrw/devel/OH/git/poky/trunk/build/tmp/work/armv5te-poky-linux-gnueabi/webkit-gtk-0.1+svnr31457-r4/temp/log.do_compile.4567)
| NOTE: make
| make  all-am
| make[1]: Entering directory `/home/hrw/devel/OH/git/poky/trunk/build/tmp/work/armv5te-poky-linux-gnueabi/webkit-gtk-0.1+svnr31457-r4'
| /bin/sh ./arm-poky-linux-gnueabi-libtool --tag=CXX   --mode=compile ccache arm-poky-linux-gnueabi-g++ -march=armv5te -mtune=arm926ej-s -DHAVE_CONFIG_H -I.  -DWTF_USE_ICU_UNICODE=1 -DBUILDING_GTK__=1 -DWTF_CHANGES  -DXP_UNIX -DNDEBUG     -I./WebCore -I./WebCore/platform -I./WebCore/platform/network -I./WebCore/platform/graphics -I./WebCore/platform/text -I./WebCore/loader -I./WebCore/loader/archive -I./WebCore/loader/icon -I./WebCore/css -I./WebCore/dom -I./WebCore/page -I./WebCore/bridge -I./WebCore/bridge/c -I./WebCore/editing -I./WebCore/history -I./WebCore/xml -I./WebCore/html -I./WebCore/bindings/js -I./WebCore/platform/image-decoders -I./WebCore/platform/image-decoders/bmp -I./WebCore/platform/image-decoders/gif -I./WebCore/platform/image-decoders/ico -I./WebCore/platform/image-decoders/jpeg -I./WebCore/platform/image-decoders/png -I./WebCore/platform/image-decoders/xbm -I./WebCore/plugins -I./WebCore/rendering -I./WebCore/bindings/js -DWTF_USE_CURL=1 -I./WebCore/platform/network/curl  -DENABLE_CROSS_DOCUMENT_MESSAGING=1 -DENABLE_DATABASE=1 -I./WebCore/platform/sql -I./WebCore/storage -DENABLE_ICONDATABASE=1   -DENABLE_XPATH=1 -DENABLE_XSLT=1 -DENABLE_SVG=1 -I\./WebCore/svg -I\./WebCore/svg/graphics -I\./WebCore/svg/graphics/filters       -I./JavaScriptCore -I./JavaScriptCore/ForwardingHeaders -I./JavaScriptCore/wtf -I./JavaScriptCore/kjs -I./DerivedSources -I./JavaScriptCore/ForwardingHeaders -I./JavaScriptCore/wtf/unicode -I./JavaScriptCore/pcre -I./JavaScriptCore/kjs  -I./WebKit/gtk/webkit -DBUILDING_CAIRO__=1 -DBUILD_WEBKIT -I./WebCore/platform/gtk -I./WebCore/platform/graphics/gtk -I./WebCore/platform/graphics/cairo -I./WebCore/loader/gtk -I./WebCore/page/gtk -I./WebKit/gtk -I./WebKit/gtk/WebCoreSupport -I./WebKit/gtk/webkit -DUSE_FREETYPE=1  -I./WebCore/svg/graphics/cairo  -fno-strict-aliasing -fvisibility-inlines-hidden -fno-rtti -Wall -W -Wcast-align -Wchar-subscripts -Wreturn-type -Wformat -Wformat-security -Wno-format-y2k -Wundef -Wmissing-format-attribute -Wpointer-arith -Wwrite-strings -Wno-unused-parameter -fno-exceptions -fvisibility=hidden -pthread -I/home/hrw/devel/OH/git/poky/trunk/build/tmp/staging/arm-poky-linux-gnueabi/usr/include/glib-2.0 -I/home/hrw/devel/OH/git/poky/trunk/build/tmp/staging/arm-poky-linux-gnueabi/usr/lib/glib-2.0/include   -D_REENTRANT -I/home/hrw/devel/OH/git/poky/trunk/build/tmp/staging/arm-poky-linux-gnueabi/usr/include -I/home/hrw/devel/OH/git/poky/trunk/build/tmp/staging/arm-poky-linux-gnueabi/usr/include/gtk-2.0 -I/home/hrw/devel/OH/git/poky/trunk/build/tmp/staging/arm-poky-linux-gnueabi/usr/lib/gtk-2.0/include -I/home/hrw/devel/OH/git/poky/trunk/build/tmp/staging/arm-poky-linux-gnueabi/usr/include/atk-1.0 -I/home/hrw/devel/OH/git/poky/trunk/build/tmp/staging/arm-poky-linux-gnueabi/usr/include/cairo -I/home/hrw/devel/OH/git/poky/trunk/build/tmp/staging/arm-poky-linux-gnueabi/usr/include/pango-1.0 -I/home/hrw/devel/OH/git/poky/trunk/build/tmp/staging/arm-poky-linux-gnueabi/usr/include/glib-2.0 -I/home/hrw/devel/OH/git/poky/trunk/build/tmp/staging/arm-poky-linux-gnueabi/usr/lib/glib-2.0/include -I/home/hrw/devel/OH/git/poky/trunk/build/tmp/staging/arm-poky-linux-gnueabi/usr/include/freetype2 -I/home/hrw/devel/OH/git/poky/trunk/build/tmp/staging/arm-poky-linux-gnueabi/usr/include/libpng12 -I/home/hrw/devel/OH/git/poky/trunk/build/tmp/staging/arm-poky-linux-gnueabi/usr/include/libxml2       -I/home/hrw/devel/OH/git/poky/trunk/build/tmp/staging/arm-poky-linux-gnueabi/usr/include/libxml2     -fexpensive-optimizations -fomit-frame-pointer -frename-registers -O2 -fpermissive -fvisibility-inlines-hidden -MT DerivedSources/libWebCore_la-JSSVGAltGlyphElement.lo -MD -MP -MF DerivedSources/.deps/libWebCore_la-JSSVGAltGlyphElement.Tpo -c -o DerivedSources/libWebCore_la-JSSVGAltGlyphElement.lo `test -f 'DerivedSources/JSSVGAltGlyphElement.cpp' || echo './'`DerivedSources/JSSVGAltGlyphElement.cpp
|  ccache arm-poky-linux-gnueabi-g++ -march=armv5te -mtune=arm926ej-s -DHAVE_CONFIG_H -I. -DWTF_USE_ICU_UNICODE=1 -DBUILDING_GTK__=1 -DWTF_CHANGES -DXP_UNIX -DNDEBUG -I./WebCore -I./WebCore/platform -I./WebCore/platform/network -I./WebCore/platform/graphics -I./WebCore/platform/text -I./WebCore/loader -I./WebCore/loader/archive -I./WebCore/loader/icon -I./WebCore/css -I./WebCore/dom -I./WebCore/page -I./WebCore/bridge -I./WebCore/bridge/c -I./WebCore/editing -I./WebCore/history -I./WebCore/xml -I./WebCore/html -I./WebCore/bindings/js -I./WebCore/platform/image-decoders -I./WebCore/platform/image-decoders/bmp -I./WebCore/platform/image-decoders/gif -I./WebCore/platform/image-decoders/ico -I./WebCore/platform/image-decoders/jpeg -I./WebCore/platform/image-decoders/png -I./WebCore/platform/image-decoders/xbm -I./WebCore/plugins -I./WebCore/rendering -I./WebCore/bindings/js -DWTF_USE_CURL=1 -I./WebCore/platform/network/curl -DENABLE_CROSS_DOCUMENT_MESSAGING=1 -DENABLE_DATABASE=1 -I./WebCore/platform/sql -I./WebCore/storage -DENABLE_ICONDATABASE=1 -DENABLE_XPATH=1 -DENABLE_XSLT=1 -DENABLE_SVG=1 -I./WebCore/svg -I./WebCore/svg/graphics -I./WebCore/svg/graphics/filters -I./JavaScriptCore -I./JavaScriptCore/ForwardingHeaders -I./JavaScriptCore/wtf -I./JavaScriptCore/kjs -I./DerivedSources -I./JavaScriptCore/ForwardingHeaders -I./JavaScriptCore/wtf/unicode -I./JavaScriptCore/pcre -I./JavaScriptCore/kjs -I./WebKit/gtk/webkit -DBUILDING_CAIRO__=1 -DBUILD_WEBKIT -I./WebCore/platform/gtk -I./WebCore/platform/graphics/gtk -I./WebCore/platform/graphics/cairo -I./WebCore/loader/gtk -I./WebCore/page/gtk -I./WebKit/gtk -I./WebKit/gtk/WebCoreSupport -I./WebKit/gtk/webkit -DUSE_FREETYPE=1 -I./WebCore/svg/graphics/cairo -fno-strict-aliasing -fvisibility-inlines-hidden -fno-rtti -Wall -W -Wcast-align -Wchar-subscripts -Wreturn-type -Wformat -Wformat-security -Wno-format-y2k -Wundef -Wmissing-format-attribute -Wpointer-arith -Wwrite-strings -Wno-unused-parameter -fno-exceptions -fvisibility=hidden -pthread -I/home/hrw/devel/OH/git/poky/trunk/build/tmp/staging/arm-poky-linux-gnueabi/usr/include/glib-2.0 -I/home/hrw/devel/OH/git/poky/trunk/build/tmp/staging/arm-poky-linux-gnueabi/usr/lib/glib-2.0/include -D_REENTRANT -I/home/hrw/devel/OH/git/poky/trunk/build/tmp/staging/arm-poky-linux-gnueabi/usr/include -I/home/hrw/devel/OH/git/poky/trunk/build/tmp/staging/arm-poky-linux-gnueabi/usr/include/gtk-2.0 -I/home/hrw/devel/OH/git/poky/trunk/build/tmp/staging/arm-poky-linux-gnueabi/usr/lib/gtk-2.0/include -I/home/hrw/devel/OH/git/poky/trunk/build/tmp/staging/arm-poky-linux-gnueabi/usr/include/atk-1.0 -I/home/hrw/devel/OH/git/poky/trunk/build/tmp/staging/arm-poky-linux-gnueabi/usr/include/cairo -I/home/hrw/devel/OH/git/poky/trunk/build/tmp/staging/arm-poky-linux-gnueabi/usr/include/pango-1.0 -I/home/hrw/devel/OH/git/poky/trunk/build/tmp/staging/arm-poky-linux-gnueabi/usr/include/glib-2.0 -I/home/hrw/devel/OH/git/poky/trunk/build/tmp/staging/arm-poky-linux-gnueabi/usr/lib/glib-2.0/include -I/home/hrw/devel/OH/git/poky/trunk/build/tmp/staging/arm-poky-linux-gnueabi/usr/include/freetype2 -I/home/hrw/devel/OH/git/poky/trunk/build/tmp/staging/arm-poky-linux-gnueabi/usr/include/libpng12 -I/home/hrw/devel/OH/git/poky/trunk/build/tmp/staging/arm-poky-linux-gnueabi/usr/include/libxml2 -I/home/hrw/devel/OH/git/poky/trunk/build/tmp/staging/arm-poky-linux-gnueabi/usr/include/libxml2 -fexpensive-optimizations -fomit-frame-pointer -frename-registers -O2 -fpermissive -fvisibility-inlines-hidden -MT DerivedSources/libWebCore_la-JSSVGAltGlyphElement.lo -MD -MP -MF DerivedSources/.deps/libWebCore_la-JSSVGAltGlyphElement.Tpo -c DerivedSources/JSSVGAltGlyphElement.cpp  -fPIC -DPIC -o DerivedSources/.libs/libWebCore_la-JSSVGAltGlyphElement.o
| In file included from ./WebCore/dom/Document.h:37,
|                  from DerivedSources/JSSVGAltGlyphElement.cpp:27:
| ./WebCore/platform/text/StringHash.h: In static member function 'static bool WebCore::StringHash::equal(WebCore::StringImpl*, WebCore::StringImpl*)':
| ./WebCore/platform/text/StringHash.h:49: warning: cast from 'const UChar*' to 'const uint32_t*' increases required alignment of target type
| ./WebCore/platform/text/StringHash.h:50: warning: cast from 'const UChar*' to 'const uint32_t*' increases required alignment of target type
| DerivedSources/JSSVGAltGlyphElement.cpp: In constructor 'WebCore::JSSVGAltGlyphElement::JSSVGAltGlyphElement(KJS::JSObject*, WebCore::SVGAltGlyphElement*)':
| DerivedSources/JSSVGAltGlyphElement.cpp:75: error: no matching function for call to 'WebCore::JSSVGTextPositioningElement::JSSVGTextPositioningElement(KJS::JSObject*&, WebCore::SVGAltGlyphElement*&)'
| DerivedSources/JSSVGTextPositioningElement.h:36: note: candidates are: WebCore::JSSVGTextPositioningElement::JSSVGTextPositioningElement(KJS::JSObject*, WebCore::SVGTextPositioningElement*)
| DerivedSources/JSSVGTextPositioningElement.h:33: note:                 WebCore::JSSVGTextPositioningElement::JSSVGTextPositioningElement(const WebCore::JSSVGTextPositioningElement&)
| DerivedSources/JSSVGAltGlyphElement.cpp: In member function 'KJS::JSValue* WebCore::JSSVGAltGlyphElement::getValueProperty(KJS::ExecState*, int) const':
| DerivedSources/JSSVGAltGlyphElement.cpp:88: error: invalid static_cast from type 'WebCore::SVGElement*' to type 'WebCore::SVGAltGlyphElement*'
| DerivedSources/JSSVGAltGlyphElement.cpp:89: error: invalid use of incomplete type 'struct WebCore::SVGAltGlyphElement'
| DerivedSources/JSSVGAltGlyphElement.h:31: error: forward declaration of 'struct WebCore::SVGAltGlyphElement'
| DerivedSources/JSSVGAltGlyphElement.cpp:92: error: invalid static_cast from type 'WebCore::SVGElement*' to type 'WebCore::SVGAltGlyphElement*'
| DerivedSources/JSSVGAltGlyphElement.cpp:93: error: invalid use of incomplete type 'struct WebCore::SVGAltGlyphElement'
| DerivedSources/JSSVGAltGlyphElement.h:31: error: forward declaration of 'struct WebCore::SVGAltGlyphElement'
| DerivedSources/JSSVGAltGlyphElement.cpp:96: error: invalid static_cast from type 'WebCore::SVGElement*' to type 'WebCore::SVGAltGlyphElement*'
| DerivedSources/JSSVGAltGlyphElement.cpp:97: error: invalid use of incomplete type 'struct WebCore::SVGAltGlyphElement'
| DerivedSources/JSSVGAltGlyphElement.h:31: error: forward declaration of 'struct WebCore::SVGAltGlyphElement'
| DerivedSources/JSSVGAltGlyphElement.cpp:98: error: no matching function for call to 'toJS(KJS::ExecState*&, WebCore::SVGAnimatedTemplate<WebCore::String>*, WebCore::SVGAltGlyphElement*&)'
| ./DerivedSources/JSNode.h:71: note: candidates are: KJS::JSValue* WebCore::toJS(KJS::ExecState*, WebCore::Node*)
| ./DerivedSources/JSNode.h:72: note:                 KJS::JSValue* WebCore::toJS(KJS::ExecState*, WebCore::EventTargetNode*)
| ./DerivedSources/JSEvent.h:63: note:                 KJS::JSValue* WebCore::toJS(KJS::ExecState*, WebCore::Event*)
| ./WebCore/bindings/js/JSEventTargetBase.h:152: note:                 KJS::JSValue* WebCore::toJS(KJS::ExecState*, WebCore::EventTarget*)
| DerivedSources/JSSVGAnimatedString.h:57: note:                 KJS::JSValue* WebCore::toJS(KJS::ExecState*, WebCore::SVGAnimatedString*, WebCore::SVGElement*)
| DerivedSources/JSSVGAltGlyphElement.cpp: In member function 'void WebCore::JSSVGAltGlyphElement::putValueProperty(KJS::ExecState*, int, KJS::JSValue*)':
| DerivedSources/JSSVGAltGlyphElement.cpp:113: error: invalid static_cast from type 'WebCore::SVGElement*' to type 'WebCore::SVGAltGlyphElement*'
| DerivedSources/JSSVGAltGlyphElement.cpp:115: error: invalid use of incomplete type 'struct WebCore::SVGAltGlyphElement'
| DerivedSources/JSSVGAltGlyphElement.h:31: error: forward declaration of 'struct WebCore::SVGAltGlyphElement'
| DerivedSources/JSSVGAltGlyphElement.cpp:120: error: invalid static_cast from type 'WebCore::SVGElement*' to type 'WebCore::SVGAltGlyphElement*'
| DerivedSources/JSSVGAltGlyphElement.cpp:122: error: invalid use of incomplete type 'struct WebCore::SVGAltGlyphElement'
| DerivedSources/JSSVGAltGlyphElement.h:31: error: forward declaration of 'struct WebCore::SVGAltGlyphElement'
| ./JavaScriptCore/wtf/Vector.h: In member function 'T* WTF::VectorBuffer<T, inlineCapacity>::inlineBuffer() [with T = WebCore::AtomicString, unsigned int inlineCapacity = 8u]':
| ./JavaScriptCore/wtf/Vector.h:341:   instantiated from 'WTF::VectorBuffer<T, inlineCapacity>::VectorBuffer() [with T = WebCore::AtomicString, unsigned int inlineCapacity = 8u]'
| ./JavaScriptCore/wtf/Vector.h:403:   instantiated from 'WTF::Vector<T, inlineCapacity>::Vector() [with T = WebCore::AtomicString, unsigned int inlineCapacity = 8u]'
| ./WebCore/dom/ClassNames.h:33:   instantiated from here
| ./JavaScriptCore/wtf/Vector.h:384: warning: cast from 'char (*)[32]' to 'WebCore::AtomicString*' increases required alignment of target type
| ./JavaScriptCore/wtf/Vector.h: In member function 'T* WTF::VectorBuffer<T, inlineCapacity>::inlineBuffer() [with T = KJS::JSValue*, unsigned int inlineCapacity = 8u]':
| ./JavaScriptCore/wtf/Vector.h:341:   instantiated from 'WTF::VectorBuffer<T, inlineCapacity>::VectorBuffer() [with T = KJS::JSValue*, unsigned int inlineCapacity = 8u]'
| ./JavaScriptCore/wtf/Vector.h:403:   instantiated from 'WTF::Vector<T, inlineCapacity>::Vector() [with T = KJS::JSValue*, unsigned int inlineCapacity = 8u]'
| ./JavaScriptCore/kjs/list.h:45:   instantiated from here
| ./JavaScriptCore/wtf/Vector.h:384: warning: cast from 'char (*)[32]' to 'KJS::JSValue**' increases required alignment of target type
| ./JavaScriptCore/wtf/Vector.h: In member function 'T* WTF::VectorBuffer<T, inlineCapacity>::inlineBuffer() [with T = KJS::LocalStorageEntry, unsigned int inlineCapacity = 32u]':
| ./JavaScriptCore/wtf/Vector.h:341:   instantiated from 'WTF::VectorBuffer<T, inlineCapacity>::VectorBuffer() [with T = KJS::LocalStorageEntry, unsigned int inlineCapacity = 32u]'
| ./JavaScriptCore/wtf/Vector.h:403:   instantiated from 'WTF::Vector<T, inlineCapacity>::Vector() [with T = KJS::LocalStorageEntry, unsigned int inlineCapacity = 32u]'
| ./JavaScriptCore/kjs/JSVariableObject.h:63:   instantiated from here
| ./JavaScriptCore/wtf/Vector.h:384: warning: cast from 'char (*)[256]' to 'KJS::LocalStorageEntry*' increases required alignment of target type
| ./JavaScriptCore/wtf/Vector.h: In member function 'T* WTF::VectorBuffer<T, inlineCapacity>::inlineBuffer() [with T = KJS::ExecState*, unsigned int inlineCapacity = 16u]':
| ./JavaScriptCore/wtf/Vector.h:341:   instantiated from 'WTF::VectorBuffer<T, inlineCapacity>::VectorBuffer() [with T = KJS::ExecState*, unsigned int inlineCapacity = 16u]'
| ./JavaScriptCore/wtf/Vector.h:403:   instantiated from 'WTF::Vector<T, inlineCapacity>::Vector() [with T = KJS::ExecState*, unsigned int inlineCapacity = 16u]'
| ./JavaScriptCore/kjs/JSGlobalObject.h:81:   instantiated from here
| ./JavaScriptCore/wtf/Vector.h:384: warning: cast from 'char (*)[64]' to 'KJS::ExecState**' increases required alignment of target type
| ./JavaScriptCore/wtf/ListHashSet.h: In member function 'WTF::ListHashSetNode<ValueArg>* WTF::ListHashSetNodeAllocator<ValueArg>::pool() [with ValueArg = WebCore::HTMLFormControlElementWithState*]':
| ./JavaScriptCore/wtf/ListHashSet.h:170:   instantiated from 'WTF::ListHashSetNode<ValueArg>* WTF::ListHashSetNodeAllocator<ValueArg>::pastPool() [with ValueArg = WebCore::HTMLFormControlElementWithState*]'
| ./JavaScriptCore/wtf/ListHashSet.h:141:   instantiated from 'WTF::ListHashSetNode<ValueArg>* WTF::ListHashSetNodeAllocator<ValueArg>::allocate() [with ValueArg = WebCore::HTMLFormControlElementWithState*]'
| ./JavaScriptCore/wtf/ListHashSet.h:201:   instantiated from 'static void* WTF::ListHashSetNode<ValueArg>::operator new(size_t, WTF::ListHashSetNodeAllocator<ValueArg>*) [with ValueArg = WebCore::HTMLFormControlElementWithState*]'
| ./JavaScriptCore/wtf/ListHashSet.h:346:   instantiated from 'static void WTF::ListHashSetTranslator<ValueType, HashFunctions>::translate(WTF::ListHashSetNode<ValueArg>*&, const ValueType&, WTF::ListHashSetNodeAllocator<ValueArg>*) [with ValueType = WebCore::HTMLFormControlElementWithState*, HashFunctions = WTF::PtrHash<WebCore::HTMLFormControlElementWithState*>]'
| ./JavaScriptCore/wtf/HashTable.h:659:   instantiated from 'std::pair<typename WTF::HashTable<Key, Value, Extractor, HashFunctions, Traits, KeyTraits>::iterator, bool> WTF::HashTable<Key, Value, Extractor, HashFunctions, Traits, KeyTraits>::add(const T&, const Extra&) [with T = WebCore::HTMLFormControlElementWithState*, Extra = WTF::ListHashSetNodeAllocator<WebCore::HTMLFormControlElementWithState*>*, HashTranslator = WTF::ListHashSetTranslator<WebCore::HTMLFormControlElementWithState*, WTF::PtrHash<WebCore::HTMLFormControlElementWithState*> >, Key = WTF::ListHashSetNode<WebCore::HTMLFormControlElementWithState*>*, Value = WTF::ListHashSetNode<WebCore::HTMLFormControlElementWithState*>*, Extractor = WTF::IdentityExtractor<WTF::ListHashSetNode<WebCore::HTMLFormControlElementWithState*>*>, HashFunctions = WTF::ListHashSetNodeHashFunctions<WebCore::HTMLFormControlElementWithState*, WTF::PtrHash<WebCore::HTMLFormControlElementWithState*> >, Traits = WTF::HashTraits<WTF::ListHashSetNode<WebCore::HTMLFormControlElementWithState*>*>, KeyTraits = WTF::HashTraits<WTF::ListHashSetNode<WebCore::HTMLFormControlElementWithState*>*>]'
| ./JavaScriptCore/wtf/ListHashSet.h:465:   instantiated from 'std::pair<typename WTF::ListHashSet<Value, HashFunctions>::iterator, bool> WTF::ListHashSet<Value, HashFunctions>::add(const ValueArg&) [with ValueArg = WebCore::HTMLFormControlElementWithState*, HashArg = WTF::PtrHash<WebCore::HTMLFormControlElementWithState*>]'
| ./WebCore/dom/Document.h:321:   instantiated from here
| ./JavaScriptCore/wtf/ListHashSet.h:169: warning: cast from 'char*' to 'WTF::ListHashSetNode<WebCore::HTMLFormControlElementWithState*>*' increases required alignment of target type
| make[1]: *** [DerivedSources/libWebCore_la-JSSVGAltGlyphElement.lo] Error 1
| make[1]: Leaving directory `/home/hrw/devel/OH/git/poky/trunk/build/tmp/work/armv5te-poky-linux-gnueabi/webkit-gtk-0.1+svnr31457-r4'
| make: *** [all] Error 2
| FATAL: oe_runmake failed
NOTE: Task failed: /home/hrw/devel/OH/git/poky/trunk/build/tmp/work/armv5te-poky-linux-gnueabi/webkit-gtk-0.1+svnr31457-r4/temp/log.do_compile.4567
NOTE: package webkit-gtk-0.1+svnr31457-r4: task do_compile: failed