All pastes #964703 Raw Edit

Miscellany

public text v1 · immutable
#964703 ·published 2008-03-31 13:52 UTC
rendered paste body
Tests run: 3, Failures: 0, Errors: 3, Skipped: 0, Time elapsed: 0.594 sec <<< FAILURE!
testGet(org.geoserver.wfs.DescribeFeatureTest)  Time elapsed: 0.118 sec  <<< ERROR!
org.springframework.beans.factory.BeanCreationException: Error creating bean with name 'data' defined in URL [jar:file:/home/david/Projects/geoserver-geosearch/main/target/main-1.7.0-SNAPSHOT.jar
!/applicationContext.xml]: Instantiation of bean failed; nested exception is org.springframework.beans.FatalBeanException: Could not instantiate class [org.vfny.geoserver.global.Data]; constructo
r threw exception; nested exception is java.lang.NoSuchMethodError: org.geo
tools.filter.ExpressionDOMParser.parseExpression(Lorg/w3c/dom/Node;)Lorg/geotools/filter/Expression;
org.springframework.beans.FatalBeanException: Could not instantiate class [org.vfny.geoserver.global.Data]; constructor threw exception; nested exception is java.lang.NoSuchMethodError: org.geoto
ols.filter.ExpressionDOMParser.parseExpression(Lorg/w3c/dom/Node;)Lorg/geotools/filter/Expression;
java.lang.NoSuchMethodError: org.geotools.filter.ExpressionDOMParser.parseExpression(Lorg/w3c/dom/Node;)Lorg/geotools/filter/Expression;
        at org.geotools.styling.SLDParser.parseCssParameter(SLDParser.java:1917)
        at org.geotools.styling.SLDParser.parseCssParameter(SLDParser.java:1870)
        at org.geotools.styling.SLDParser.parseFill(SLDParser.java:1833)
        at org.geotools.styling.SLDParser.parsePolygonSymbolizer(SLDParser.java:984)
        at org.geotools.styling.SLDParser.parseRule(SLDParser.java:881)
        at org.geotools.styling.SLDParser.parseFeatureTypeStyle(SLDParser.java:790)
        at org.geotools.styling.SLDParser.parseStyle(SLDParser.java:737)
        at org.geotools.styling.SLDParser.readDOM(SLDParser.java:282)
        at org.geotools.styling.SLDParser.readXML(SLDParser.java:259)
        at org.vfny.geoserver.global.Data.loadStyle(Data.java:1435)
        at org.vfny.geoserver.global.Data.loadStyles(Data.java:843)
        at org.vfny.geoserver.global.Data.load(Data.java:234)
        at org.vfny.geoserver.global.Data.<init>(Data.java:181)
        at org.vfny.geoserver.global.Data.<init>(Data.java:191)
        at sun.reflect.GeneratedConstructorAccessor23.newInstance(Unknown Source)
        at sun.reflect.DelegatingConstructorAccessorImpl.newInstance(DelegatingConstructorAccessorImpl.java:27)
        at java.lang.reflect.Constructor.newInstance(Constructor.java:494)
        at org.springframework.beans.BeanUtils.instantiateClass(BeanUtils.java:100)
        at org.springframework.beans.factory.support.SimpleInstantiationStrategy.instantiate(SimpleInstantiationStrategy.java:75)
        at org.springframework.beans.factory.support.AbstractAutowireCapableBeanFactory.autowireConstructor(AbstractAutowireCapableBeanFactory.java:669)
        at org.springframework.beans.factory.support.AbstractAutowireCapableBeanFactory.createBean(AbstractAutowireCapableBeanFactory.java:329)
        at org.springframework.beans.factory.support.AbstractBeanFactory.getBean(AbstractBeanFactory.java:226)
        at org.springframework.beans.factory.support.AbstractBeanFactory.getBean(AbstractBeanFactory.java:147)
        at org.springframework.beans.factory.support.DefaultListableBeanFactory.preInstantiateSingletons(DefaultListableBeanFactory.java:275)
        at org.springframework.context.support.AbstractApplicationContext.refresh(AbstractApplicationContext.java:318)
        at org.geoserver.test.GeoServerAbstractTestSupport.setUp(GeoServerAbstractTestSupport.java:139)
        at org.geoserver.wfs.WFSTestSupport.setUp(WFSTestSupport.java:50)
        at junit.framework.TestCase.runBare(TestCase.java:128)
        at junit.framework.TestResult$1.protect(TestResult.java:106)
        at junit.framework.TestResult.runProtected(TestResult.java:124)
        at junit.framework.TestResult.run(TestResult.java:109)
        at junit.framework.TestCase.run(TestCase.java:120)
        at junit.framework.TestSuite.runTest(TestSuite.java:230)
        at junit.framework.TestSuite.run(TestSuite.java:225)
        at sun.reflect.GeneratedMethodAccessor48.invoke(Unknown Source)
        at sun.reflect.DelegatingMethodAccessorImpl.invoke(DelegatingMethodAccessorImpl.java:25)
        at java.lang.reflect.Method.invoke(Method.java:585)
        at org.apache.maven.surefire.junit.JUnitTestSet.execute(JUnitTestSet.java:213)
        at org.apache.maven.surefire.suite.AbstractDirectoryTestSuite.executeTestSet(AbstractDirectoryTestSuite.java:140)
        at org.apache.maven.surefire.suite.AbstractDirectoryTestSuite.execute(AbstractDirectoryTestSuite.java:127)
        at org.apache.maven.surefire.Surefire.run(Surefire.java:177)
        at sun.reflect.NativeMethodAccessorImpl.invoke0(Native Method)
        at sun.reflect.NativeMethodAccessorImpl.invoke(NativeMethodAccessorImpl.java:39)
        at sun.reflect.DelegatingMethodAccessorImpl.invoke(DelegatingMethodAccessorImpl.java:25)
        at java.lang.reflect.Method.invoke(Method.java:585)
        at org.apache.maven.surefire.booter.SurefireBooter.runSuitesInProcess(SurefireBooter.java:338)
        at org.apache.maven.surefire.booter.SurefireBooter.main(SurefireBooter.java:997)