[ 29%] Building CXX object soprano/test/CMakeFiles/storagescalingtest.dir/storagescalingtest.o
"/opt/foss/include/rw/_pair.h", line 55: Error: In this declaration "second" is of an incomplete type "ArchiveEntryCache::SubEntry".
"/opt/foss/include/rw/_tree.h", line 86: Where: While specializing "std::pair<const std::string, ArchiveEntryCache::SubEntry>".
"/opt/foss/include/rw/_tree.h", line 86: Where: Specialized in __rw::__rw_rb_tree_node<std::allocator<std::pair<const std::string, ArchiveEntryCache::SubEntry>>, std::pair<const std::string, ArchiveEntryCache::SubEntry>, std::string, __rw::__select1st<std::pair<const std::string, ArchiveEntryCache::SubEntry>, std::string>>.
"/opt/foss/include/rw/_tree.h", line 259: Where: Specialized in __rw::__rb_tree<std::string, std::pair<const std::string, ArchiveEntryCache::SubEntry>, __rw::__select1st<std::pair<const std::string, ArchiveEntryCache::SubEntry>, std::string>, std::less<std::string>, std::allocator<std::pair<const std::string, ArchiveEntryCache::SubEntry>>>.
"/opt/foss/include/map", line 86: Where: Specialized in std::map<std::string,ArchiveEntryCache::SubEntry>.
"/home/luc/repositories/KDE4/kdesupport/strigi/src/streams/archivereader.cpp", line 68: Where: Specialized in non-template code.
"/home/luc/repositories/KDE4/kdesupport/strigi/src/streams/archivereader.cpp", line 140: Error: const int is not a structure type.
"/home/luc/repositories/KDE4/kdesupport/strigi/src/streams/archivereader.cpp", line 140: Error: const int is not a structure type.
"/home/luc/repositories/KDE4/kdesupport/strigi/src/streams/archivereader.cpp", line 140: Error: const int is not a structure type.
"/home/luc/repositories/KDE4/kdesupport/strigi/src/streams/archivereader.cpp", line 150: Error: const int is not a structure type.
"/home/luc/repositories/KDE4/kdesupport/strigi/src/streams/archivereader.cpp", line 197: Error: Cannot assign const int* to const ArchiveEntryCache::SubEntry*.
"/home/luc/repositories/KDE4/kdesupport/strigi/src/streams/archivereader.cpp", line 283: Error: Cannot assign int* to ArchiveEntryCache::SubEntry*.
"/home/luc/repositories/KDE4/kdesupport/strigi/src/streams/archivereader.cpp", line 607: Error: const int is not a structure type.
"/home/luc/repositories/KDE4/kdesupport/strigi/src/streams/archivereader.cpp", line 607: Error: Formal argument __x of type const Strigi::EntryInfo& in call to std::vector<Strigi::EntryInfo>::push_back(const Strigi::EntryInfo&) is being passed int.
9 Error(s) detected.
make[3]: *** [strigi/src/streams/CMakeFiles/streams.dir/archivereader.o] Error 9
make[3]: Leaving directory `/home/luc/packages/BUILD/KDE4/kdesupport'
make[2]: *** [strigi/src/streams/CMakeFiles/streams.dir/all] Error 2
make[2]: *** Waiting for unfinished jobs....
Linking CXX executable storagescalingtest
make[3]: Leaving directory `/home/luc/packages/BUILD/KDE4/kdesupport'
[ 29%] Built target storagescalingtest
make[2]: Leaving directory `/home/luc/packages/BUILD/KDE4/kdesupport'
make[1]: *** [all] Error 2
make[1]: Leaving directory `/home/luc/packages/BUILD/KDE4/kdesupport'
make: *** [build] Error 2