All pastes #964387 Raw Edit

Mine

public text v1 · immutable
#964387 ·published 2008-03-31 05:12 UTC
rendered paste body
Makefile:63: warning: overriding commands for target `clean'
makerules:46: warning: ignoring old commands for target `clean'
echo '#define PROGRAM_NAME "FILO"' > main/version.h
echo '#define PROGRAM_VERSION "0.5 (f@tux) Mon Mar 31 13:07:34 CST 2008"' >> main/version.h
make -C main
make[1]: Entering directory `/mnt/pptux/trees/svn/filo-0.5/main'
gcc -m32 -Wall -Os -fomit-frame-pointer -fno-common -ffreestanding -fno-strict-aliasing -Wno-pointer-sign -Wno-unused  -nostdinc -imacros ../config.h -I../include -I/usr/lib/gcc/i686-pc-linux-gnu/4.1.2/include -MD -c filo.c -o filo.o
In file included from filo.c:1:
../include/lib.h:36: error: expected ‘)’ before ‘size’
../include/lib.h:38: error: expected ‘)’ before ‘nmemb’
../include/lib.h:39: error: expected declaration specifiers or ‘...’ before ‘size_t’
../include/lib.h:42: error: expected ‘)’ before ‘size’
../include/lib.h:46: error: expected ‘=’, ‘,’, ‘;’, ‘asm’ or ‘__attribute__’ before ‘strnlen’
../include/lib.h:47: error: expected ‘=’, ‘,’, ‘;’, ‘asm’ or ‘__attribute__’ before ‘strlen’
../include/lib.h:49: error: expected declaration specifiers or ‘...’ before ‘size_t’
../include/lib.h:50: error: expected declaration specifiers or ‘...’ before ‘size_t’
../include/lib.h:51: error: expected declaration specifiers or ‘...’ before ‘size_t’
../include/lib.h:52: error: expected declaration specifiers or ‘...’ before ‘size_t’
make[1]: *** [filo.o] Error 1
make[1]: Leaving directory `/mnt/pptux/trees/svn/filo-0.5/main'
make: *** [main/builtin.o] Error 2