rendered paste bodytouch /home/alesan/kamikaze/build_dir/mipsel/multilapse-0.0.1/.configured
make -C /home/alesan/kamikaze/build_dir/mipsel/multilapse-0.0.1 AR=mipsel-linux-uclibc-ar AS="mipsel-linux-uclibc-gcc -c -Os -pipe -mips32 -mtune=mips32 -funit-at-a-time -fhonour-copts" LD=mipsel-linux-uclibc-ld NM=mipsel-linux-uclibc-nm CC="mipsel-linux-uclibc-gcc" GCC="mipsel-linux-uclibc-gcc" CXX=mipsel-linux-uclibc-g++ RANLIB=mipsel-linux-uclibc-ranlib STRIP=mipsel-linux-uclibc-strip OBJCOPY=mipsel-linux-uclibc-objcopy OBJDUMP=mipsel-linux-uclibc-objdump SIZE=mipsel-linux-uclibc-size CPPFLAGS=-I/home/alesan/kamikaze/staging_dir/mipsel/usr/include -I/home/alesan/kamikaze/staging_dir/mipsel/include CFLAGS="-Os -pipe -mips32 -mtune=mips32 -funit-at-a-time -fhonour-copts"
make[4]: Entering directory `/home/alesan/kamikaze/build_dir/mipsel/multilapse-0.0.1'
mipsel-linux-uclibc-gcc -Os -pipe -mips32 -mtune=mips32 -funit-at-a-time -fhonour-copts -I/home/alesan/kamikaze/staging_dir/mipsel/usr/include -c -o multilapse.o multilapse.c
multilapse.c:30:21: error: uci/uci.h: No such file or directory
multilapse.c: In function 'run':
multilapse.c:162: error: 'UCI_OK' undeclared (first use in this function)
multilapse.c:162: error: (Each undeclared identifier is reported only once
multilapse.c:162: error: for each function it appears in.)
multilapse.c:164: error: invalid type argument of '->'
multilapse.c: In function 'main':
multilapse.c:250: warning: assignment makes pointer from integer without a cast
multilapse.c:252: error: 'UCI_OK' undeclared (first use in this function)
multilapse.c:260: error: invalid type argument of '->'
multilapse.c:262: error: invalid type argument of '->'
multilapse.c:272: error: invalid type argument of '->'
make[4]: *** [multilapse.o] Error 1
make[4]: Leaving directory `/home/alesan/kamikaze/build_dir/mipsel/multilapse-0.0.1'
make[3]: *** [/home/alesan/kamikaze/build_dir/mipsel/multilapse-0.0.1/.built] Error 2
make[3]: Leaving directory `/home/alesan/kamikaze/package/multilapse'
make[2]: *** [package/multilapse/compile] Error 2
make[2]: Leaving directory `/home/alesan/kamikaze'
make[1]: *** [/home/alesan/kamikaze/staging_dir/mipsel/stamp/.package_compile] Error 2
make[1]: Leaving directory `/home/alesan/kamikaze'
make: *** [world] Error 2
alesan@valkyrie:~/kamikaze$ find . -name uci.h
./build_dir/mipsel/uci-0.3.0/uci.h
alesan@valkyrie:~/kamikaze$