[INFO] ------------------------------------------------------------------------
[ERROR] BUILD FAILURE
[INFO] ------------------------------------------------------------------------
[INFO] Compilation failure
C:\Users\mtc\workspace\L2Chaos_GameServer_CT1\src\main\java\net\sf\l2j\gameserve
r\network\serverpackets\UserInfo.java:[283,48] cannot find symbol
symbol : method getdCollisionRadius()
location: class net.sf.l2j.gameserver.templates.L2PcTemplate
C:\Users\mtc\workspace\L2Chaos_GameServer_CT1\src\main\java\net\sf\l2j\gameserve
r\network\serverpackets\UserInfo.java:[284,48] cannot find symbol
symbol : method getdCollisionHeight()
location: class net.sf.l2j.gameserver.templates.L2PcTemplate
[INFO] ------------------------------------------------------------------------
[INFO] Trace
org.apache.maven.BuildFailureException: Compilation failure
at org.apache.maven.lifecycle.DefaultLifecycleExecutor.executeGoals(Defa
ultLifecycleExecutor.java:560)
at org.apache.maven.lifecycle.DefaultLifecycleExecutor.executeGoalWithLi
fecycle(DefaultLifecycleExecutor.java:480)
at org.apache.maven.lifecycle.DefaultLifecycleExecutor.forkProjectLifecy
cle(DefaultLifecycleExecutor.java:896)
at org.apache.maven.lifecycle.DefaultLifecycleExecutor.forkLifecycle(Def
aultLifecycleExecutor.java:734)
at org.apache.maven.lifecycle.DefaultLifecycleExecutor.executeGoals(Defa
ultLifecycleExecutor.java:510)
at org.apache.maven.lifecycle.DefaultLifecycleExecutor.executeStandalone
Goal(DefaultLifecycleExecutor.java:493)
at org.apache.maven.lifecycle.DefaultLifecycleExecutor.executeGoal(Defau
ltLifecycleExecutor.java:463)
at org.apache.maven.lifecycle.DefaultLifecycleExecutor.executeGoalAndHan
dleFailures(DefaultLifecycleExecutor.java:311)
at org.apache.maven.lifecycle.DefaultLifecycleExecutor.executeTaskSegmen
ts(DefaultLifecycleExecutor.java:224)
at org.apache.maven.lifecycle.DefaultLifecycleExecutor.execute(DefaultLi
fecycleExecutor.java:143)
at org.apache.maven.DefaultMaven.doExecute(DefaultMaven.java:333)
at org.apache.maven.DefaultMaven.execute(DefaultMaven.java:126)
at org.apache.maven.cli.MavenCli.main(MavenCli.java:282)
at sun.reflect.NativeMethodAccessorImpl.invoke0(Native Method)
at sun.reflect.NativeMethodAccessorImpl.invoke(NativeMethodAccessorImpl.
java:39)
at sun.reflect.DelegatingMethodAccessorImpl.invoke(DelegatingMethodAcces
sorImpl.java:25)
at java.lang.reflect.Method.invoke(Method.java:597)
at org.codehaus.classworlds.Launcher.launchEnhanced(Launcher.java:315)
at org.codehaus.classworlds.Launcher.launch(Launcher.java:255)
at org.codehaus.classworlds.Launcher.mainWithExitCode(Launcher.java:430)
at org.codehaus.classworlds.Launcher.main(Launcher.java:375)
Caused by: org.apache.maven.plugin.CompilationFailureException: Compilation fail
ure
at org.apache.maven.plugin.AbstractCompilerMojo.execute(AbstractCompiler
Mojo.java:516)
at org.apache.maven.plugin.CompilerMojo.execute(CompilerMojo.java:114)
at org.apache.maven.plugin.DefaultPluginManager.executeMojo(DefaultPlugi
nManager.java:447)
at org.apache.maven.lifecycle.DefaultLifecycleExecutor.executeGoals(Defa
ultLifecycleExecutor.java:539)
... 20 more
[INFO] ------------------------------------------------------------------------
[INFO] Total time: 22 seconds
[INFO] Finished at: Sun Mar 30 15:56:36 CEST 2008
[INFO] Final Memory: 15M/63M
[INFO] ------------------------------------------------------------------------
C:\Users\mtc\workspace\L2Chaos_GameServer_CT1>