axel@hollywood:~$ wget http://dev.darkshed.net/tip.zip
--14:44:46-- http://dev.darkshed.net/tip.zip
=> `tip.zip'
Resolving dev.darkshed.net... 85.214.125.13
Connecting to dev.darkshed.net|85.214.125.13|:80... connected.
HTTP request sent, awaiting response... 200 OK
Length: 1,494,257 (1.4M) [application/zip]
100%[==================================================================>] 1,494,257 1.75M/s
14:44:47 (1.75 MB/s) - `tip.zip' saved [1494257/1494257]
axel@hollywood:~$ unzip tip.zip
Archive: tip.zip
inflating: qubis-43197d8bec92/.hg_archival.txt
inflating: qubis-43197d8bec92/.hgignore
inflating: qubis-43197d8bec92/CHANGELOG.txt
inflating: qubis-43197d8bec92/INSTALL.txt
inflating: qubis-43197d8bec92/LICENSE.txt
inflating: qubis-43197d8bec92/README.txt
inflating: qubis-43197d8bec92/README_DEVELOPERS.txt
inflating: qubis-43197d8bec92/TODO.txt
inflating: qubis-43197d8bec92/data/busto.svg
inflating: qubis-43197d8bec92/data/car.svg
inflating: qubis-43197d8bec92/data/carrera_final3.svg
inflating: qubis-43197d8bec92/data/gallardo.svg
inflating: qubis-43197d8bec92/data/lion.svg
inflating: qubis-43197d8bec92/data/svg-logo.svg
inflating: qubis-43197d8bec92/data/svg-print-logo.svg
inflating: qubis-43197d8bec92/data/uk.svg
inflating: qubis-43197d8bec92/data/xicara.svg
inflating: qubis-43197d8bec92/qubis.pro
inflating: qubis-43197d8bec92/src/composer.cc
inflating: qubis-43197d8bec92/src/composer.hh
inflating: qubis-43197d8bec92/src/daemon.cc
inflating: qubis-43197d8bec92/src/daemon.hh
inflating: qubis-43197d8bec92/src/loader.cc
inflating: qubis-43197d8bec92/src/loader.hh
inflating: qubis-43197d8bec92/src/qubis.cc
inflating: qubis-43197d8bec92/src/qubis.qrc
inflating: qubis-43197d8bec92/src/settings.cc
inflating: qubis-43197d8bec92/src/settings.hh
inflating: qubis-43197d8bec92/src/src.pro
inflating: qubis-43197d8bec92/src/stack.cc
inflating: qubis-43197d8bec92/src/stack.hh
inflating: qubis-43197d8bec92/src/utils.cc
inflating: qubis-43197d8bec92/src/utils.hh
inflating: qubis-43197d8bec92/src/win32utils.cc
inflating: qubis-43197d8bec92/src/x11utils.cc
axel@hollywood:~$ cd qubis-43197d8bec92/
axel@hollywood:~/qubis-43197d8bec92$ ls
CHANGELOG.txt data INSTALL.txt LICENSE.txt qubis.pro README_DEVELOPERS.txt README.txt src TODO.txt
axel@hollywood:~/qubis-43197d8bec92$ leafpad INSTALL.txt
axel@hollywood:~/qubis-43197d8bec92$ qmake
axel@hollywood:~/qubis-43197d8bec92$ make
cd src && qmake src.pro -o Makefile
cd src && make -f Makefile
make[1]: Entering directory `/home/axel/qubis-43197d8bec92/src'
g++ -c -pipe -Wall -W -O2 -D_REENTRANT -DQT_NO_DEBUG -DQT_THREAD_SUPPORT -DQT_SHARED -DQT_TABLET_SUPPORT -I/u
sr/share/qt3/mkspecs/default -I. -I/usr/include/qt3 -I.tmp/ -o .tmp/qubis.o qubis.cc
In file included from qubis.cc:43:
utils.hh:50:23: error: QTextStream: No such file or directory
In file included from qubis.cc:44:
loader.hh:49:16: error: QMap: No such file or directory
loader.hh:50:16: error: QUrl: No such file or directory
In file included from qubis.cc:46:
settings.hh:49:21: error: QSettings: No such file or directory
In file included from qubis.cc:47:
stack.hh:50:17: error: QList: No such file or directory
qubis.cc:52:24: error: QApplication: No such file or directory
qubis.cc:53:19: error: QPixmap: No such file or directory
qubis.cc:54:21: error: QFileInfo: No such file or directory
qubis.cc:55:23: error: QStringList: No such file or directory
qubis.cc:56:20: error: QVariant: No such file or directory
utils.hh:56: error: ‘QTextStream’ does not name a type
utils.hh:57: error: ‘QTextStream’ does not name a type
loader.hh:67: error: expected ‘,’ or ‘...’ before ‘&’ token
loader.hh:67: error: ISO C++ forbids declaration of ‘QUrl’ with no type
loader.hh:68: error: expected ‘,’ or ‘...’ before ‘&’ token
loader.hh:68: error: ISO C++ forbids declaration of ‘QUrl’ with no type
loader.hh:78: error: expected ‘,’ or ‘...’ before ‘&’ token
loader.hh:78: error: ISO C++ forbids declaration of ‘QUrl’ with no type
loader.hh:79: error: expected ‘,’ or ‘...’ before ‘&’ token
loader.hh:79: error: ISO C++ forbids declaration of ‘QUrl’ with no type
loader.hh:83: error: ISO C++ forbids declaration of ‘QMap’ with no type
loader.hh:83: error: expected ‘;’ before ‘<’ token
loader.hh:84: error: ISO C++ forbids declaration of ‘QMap’ with no type
loader.hh:84: error: expected ‘;’ before ‘<’ token
loader.hh:86: error: ‘DB’ does not name a type
loader.hh:87: error: ‘FC’ does not name a type
settings.hh:56: error: expected class-name before ‘{’ token
stack.hh:61: error: ISO C++ forbids declaration of ‘QList’ with no type
stack.hh:61: error: expected ‘;’ before ‘<’ token
stack.hh:65: error: expected ‘,’ or ‘...’ before ‘&’ token
stack.hh:65: error: ISO C++ forbids declaration of ‘QUrl’ with no type
stack.hh:67: error: ISO C++ forbids declaration of ‘UrlList’ with no type
stack.hh:67: error: expected ‘;’ before ‘&’ token
stack.hh:69: error: expected `;' before ‘private’
stack.hh:71: error: ‘UrlList’ does not name a type
qubis.cc: In function ‘void usage()’:
qubis.cc:63: error: ‘cout’ is not a member of ‘qubis’
qubis.cc: In function ‘void help()’:
qubis.cc:76: error: ‘QFile’ was not declared in this scope
qubis.cc:76: error: expected `;' before ‘help’
qubis.cc:77: error: request for member ‘open’ in ‘help’, which is of non-class type ‘void ()()’
qubis.cc:77: error: ‘QIODevice’ has not been declared
qubis.cc:78: error: ‘cout’ is not a member of ‘qubis’
qubis.cc:78: error: request for member ‘readAll’ in ‘help’, which is of non-class type ‘void ()()’
qubis.cc: In function ‘int main(int, char**)’:
qubis.cc:86: error: ‘QApplication’ was not declared in this scope
qubis.cc:86: error: expected `;' before ‘app’
qubis.cc:88: error: ‘app’ was not declared in this scope
qubis.cc:92: error: ‘QString’ was not declared in this scope
qubis.cc:92: error: expected `;' before ‘name’
qubis.cc:101: error: expected `;' before ‘arg’
qubis.cc:103: error: ‘arg’ was not declared in this scope
qubis.cc:110: error: expected `;' before ‘lastname’
qubis.cc:111: error: ‘lastname’ was not declared in this scope
qubis.cc:112: error: ‘name’ was not declared in this scope
qubis.cc:121: error: ‘QUrl’ was not declared in this scope
qubis.cc:121: error: expected `;' before ‘url’
qubis.cc:122: error: ‘url’ was not declared in this scope
qubis.cc:125: error: ‘cerr’ is not a member of ‘qubis’
qubis.cc:132: error: ‘EXIT_FAILURE’ was not declared in this scope
qubis.cc:142: error: ‘class qubis::Stack’ has no member named ‘urls’
qubis.cc:143: error: ‘cerr’ is not a member of ‘qubis’
qubis.cc:147: error: variable ‘QPixmap bg_pixmap’ has initializer but incomplete type
qubis.cc:153: error: ‘class qubis::Settings’ has no member named ‘setValue’
qubis.cc:153: error: ‘name’ was not declared in this scope
qubis.cc: At global scope:
qubis.cc:81: warning: unused parameter ‘argc’
qubis.cc:81: warning: unused parameter ‘argv’
make[1]: *** [.tmp/qubis.o] Error 1
make[1]: Leaving directory `/home/axel/qubis-43197d8bec92/src'
make: *** [sub-src] Error 2
axel@hollywood:~/qubis-43197d8bec92$