make all-recursive
make[1]: Entering directory `/opt/mantis-1.0/build/telosb'
Making all in src
make[2]: Entering directory `/opt/mantis-1.0/build/telosb/src'
Making all in lib
make[3]: Entering directory `/opt/mantis-1.0/build/telosb/src/lib'
msp430-gcc -DHAVE_CONFIG_H -I. -I../.. -I../../../../src/lib -I../../../../src/mos/sys/include -I../../../../sr/mos/dev/include -I../../../../src/mos/kernel/micro/include -I../../../../src/mos/kernel/include -I../../../../sc/mos/share/include -I../../../../src/mos/com/include -I../../../../src/mos/net/include -I../../../../src/lib/inlude -I../../../../src/mos/kernel/msp430/include -I../../../../src/mos/kernel/msp430/boot -Wall -Wno-format-Os -g -mmcu=msp430x1611 -MT crc.o -MD -MP -MF .deps/crc.Tpo -c -o crc.o ../../../../src/lib/crc.c
In file included from ../../../../src/lib/crc.c:39:
../../../../src/lib/include/crc.h:38:22: inttypes.h: No such file or directory
In file included from ../../../../src/lib/crc.c:39:
../../../../src/lib/include/crc.h:49: syntax error before "crc_compute"
../../../../src/lib/include/crc.h:49: syntax error before '*' token
../../../../src/lib/include/crc.h:49: warning: type defaults to `int' in declaration of `crc_compute'
../../../../src/lib/include/crc.h:49: warning: data definition has no type or storage class
../../../../src/lib/crc.c:46: syntax error before "crc_compute"
../../../../src/lib/crc.c:46: syntax error before '*' token
../../../../src/lib/crc.c:47: warning: return type defaults to `int'
../../../../src/lib/crc.c: In function `crc_compute':
../../../../src/lib/crc.c:48: `uint16_t' undeclared (first use in this function)
../../../../src/lib/crc.c:48: (Each undeclared identifier is reported only once
../../../../src/lib/crc.c:48: for each function it appears in.)
../../../../src/lib/crc.c:48: syntax error before "index"
../../../../src/lib/crc.c:49: `uint8_t' undeclared (first use in this function)
../../../../src/lib/crc.c:51: `crc' undeclared (first use in this function)
../../../../src/lib/crc.c:53: `index' undeclared (first use in this function)
../../../../src/lib/crc.c:53: `size' undeclared (first use in this function)
../../../../src/lib/crc.c:54: `byte' undeclared (first use in this function)
../../../../src/lib/crc.c:54: `buf' undeclared (first use in this function)
../../../../src/lib/crc.c:58: `v' undeclared (first use in this function)
../../../../src/lib/crc.c:60: `bit' undeclared (first use in this function)
../../../../src/lib/crc.c:62: `xor_flag' undeclared (first use in this function)
make[3]: *** [crc.o] Error 1
make[3]: Leaving directory `/opt/mantis-1.0/build/telosb/src/lib'
make[2]: *** [all-recursive] Error 1
make[2]: Leaving directory `/opt/mantis-1.0/build/telosb/src'
make[1]: *** [all-recursive] Error 1
make[1]: Leaving directory `/opt/mantis-1.0/build/telosb'
make: *** [all] Error 2
pullin@outpost:/opt/mantis-1.0/build/telosb$