rendered paste body/bin/sh ../../llvm-gcc-4.0-iphone/mkinstalldirs /usr/local /usr/local
rm -rf /usr/local/libexec/gcc/arm-apple-darwin/4.0.1/install-tools
/bin/sh ../../../llvm-gcc-4.0-iphone/fixincludes/../mkinstalldirs /usr/local/libexec/gcc/arm-apple-darwin/4.0.1/install-tools
mkdir /usr/local/libexec/gcc
mkdir /usr/local/libexec/gcc/arm-apple-darwin
mkdir /usr/local/libexec/gcc/arm-apple-darwin/4.0.1
mkdir /usr/local/libexec/gcc/arm-apple-darwin/4.0.1/install-tools
/bin/sh ../../../llvm-gcc-4.0-iphone/fixincludes/../mkinstalldirs /usr/local/lib/gcc/arm-apple-darwin/4.0.1/install-tools/include
mkdir /usr/local/lib/gcc
mkdir /usr/local/lib/gcc/arm-apple-darwin
mkdir /usr/local/lib/gcc/arm-apple-darwin/4.0.1
mkdir /usr/local/lib/gcc/arm-apple-darwin/4.0.1/install-tools
mkdir /usr/local/lib/gcc/arm-apple-darwin/4.0.1/install-tools/include
/usr/bin/install -c -m 644 ../../../llvm-gcc-4.0-iphone/fixincludes/README-fixinc \
/usr/local/lib/gcc/arm-apple-darwin/4.0.1/install-tools/include/README
/usr/bin/install -c fixinc.sh /usr/local/libexec/gcc/arm-apple-darwin/4.0.1/install-tools/fixinc.sh
/usr/bin/install -c fixincl \
/usr/local/libexec/gcc/arm-apple-darwin/4.0.1/install-tools/fixincl
/usr/bin/install -c mkheaders /usr/local/libexec/gcc/arm-apple-darwin/4.0.1/install-tools/mkheaders
test -d po || mkdir po
: --statistics -o po/be.gmo ../../../llvm-gcc-4.0-iphone/gcc/po/be.po
test -d po || mkdir po
: --statistics -o po/ca.gmo ../../../llvm-gcc-4.0-iphone/gcc/po/ca.po
test -d po || mkdir po
: --statistics -o po/da.gmo ../../../llvm-gcc-4.0-iphone/gcc/po/da.po
test -d po || mkdir po
: --statistics -o po/de.gmo ../../../llvm-gcc-4.0-iphone/gcc/po/de.po
test -d po || mkdir po
: --statistics -o po/el.gmo ../../../llvm-gcc-4.0-iphone/gcc/po/el.po
test -d po || mkdir po
: --statistics -o po/es.gmo ../../../llvm-gcc-4.0-iphone/gcc/po/es.po
test -d po || mkdir po
: --statistics -o po/fr.gmo ../../../llvm-gcc-4.0-iphone/gcc/po/fr.po
test -d po || mkdir po
: --statistics -o po/ja.gmo ../../../llvm-gcc-4.0-iphone/gcc/po/ja.po
test -d po || mkdir po
: --statistics -o po/nl.gmo ../../../llvm-gcc-4.0-iphone/gcc/po/nl.po
test -d po || mkdir po
: --statistics -o po/rw.gmo ../../../llvm-gcc-4.0-iphone/gcc/po/rw.po
test -d po || mkdir po
: --statistics -o po/sv.gmo ../../../llvm-gcc-4.0-iphone/gcc/po/sv.po
test -d po || mkdir po
: --statistics -o po/tr.gmo ../../../llvm-gcc-4.0-iphone/gcc/po/tr.po
test -d po || mkdir po
: --statistics -o po/zh_CN.gmo ../../../llvm-gcc-4.0-iphone/gcc/po/zh_CN.po
/bin/sh ../../../llvm-gcc-4.0-iphone/gcc/../mkinstalldirs /usr/local/lib/gcc/arm-apple-darwin/4.0.1
/bin/sh ../../../llvm-gcc-4.0-iphone/gcc/../mkinstalldirs /usr/local/libexec/gcc/arm-apple-darwin/4.0.1
/bin/sh ../../../llvm-gcc-4.0-iphone/gcc/../mkinstalldirs /usr/local/bin
/bin/sh ../../../llvm-gcc-4.0-iphone/gcc/../mkinstalldirs /usr/local/include
/bin/sh ../../../llvm-gcc-4.0-iphone/gcc/../mkinstalldirs /usr/local/info
mkdir /usr/local/info
/bin/sh ../../../llvm-gcc-4.0-iphone/gcc/../mkinstalldirs /usr/local/arm-apple-darwin/lib
/bin/sh ../../../llvm-gcc-4.0-iphone/gcc/../mkinstalldirs /usr/local/man/man1
/bin/sh ../../../llvm-gcc-4.0-iphone/gcc/../mkinstalldirs /usr/local/man/man7
mkdir /usr/local/man/man7
rm -f /usr/local/bin/arm-apple-darwin-g++
/usr/bin/install -c g++ /usr/local/bin/arm-apple-darwin-g++
install: g++: No such file or directory
make[1]: [c++.install-common] Error 71 (ignored)
chmod a+x /usr/local/bin/arm-apple-darwin-g++
chmod: /usr/local/bin/arm-apple-darwin-g++: No such file or directory
make[1]: [c++.install-common] Error 1 (ignored)
rm -f /usr/local/bin/arm-apple-darwin-c++
( cd /usr/local/bin && \
ln arm-apple-darwin-g++ arm-apple-darwin-c++ )
ln: arm-apple-darwin-g++: No such file or directory
make[1]: [c++.install-common] Error 1 (ignored)
if [ -f cc1plus ] ; then \
if [ -f g++-cross ] ; then \
if [ -d /usr/local/lib/gcc/arm-apple-darwin/4.0.1/../../../../arm-apple-darwin/bin/. ] ; then \
rm -f /usr/local/lib/gcc/arm-apple-darwin/4.0.1/../../../../arm-apple-darwin/bin/g++; \
/usr/bin/install -c g++-cross /usr/local/lib/gcc/arm-apple-darwin/4.0.1/../../../../arm-apple-darwin/bin/g++; \
rm -f /usr/local/lib/gcc/arm-apple-darwin/4.0.1/../../../../arm-apple-darwin/bin/c++; \
( cd /usr/local/lib/gcc/arm-apple-darwin/4.0.1/../../../../arm-apple-darwin/bin && \
ln g++ c++ ); \
else true; fi; \
else \
rm -f /usr/local/bin/arm-apple-darwin-arm-apple-darwin-g++; \
( cd /usr/local/bin && \
ln arm-apple-darwin-g++ arm-apple-darwin-arm-apple-darwin-g++ ); \
rm -f /usr/local/bin/arm-apple-darwin-arm-apple-darwin-c++; \
( cd /usr/local/bin && \
ln arm-apple-darwin-c++ arm-apple-darwin-arm-apple-darwin-c++ ); \
fi ; \
fi
ln: arm-apple-darwin-g++: No such file or directory
ln: arm-apple-darwin-c++: No such file or directory
make[1]: [c++.install-common] Error 1 (ignored)
for file in cc1 cc1plus cc1obj cc1objplus; do \
if [ -f $file ] ; then \
rm -f /usr/local/libexec/gcc/arm-apple-darwin/4.0.1/$file; \
/usr/bin/install -c $file /usr/local/libexec/gcc/arm-apple-darwin/4.0.1/$file; \
else true; \
fi; \
done
for file in collect2 ..; do \
if [ x"$file" != x.. ]; then \
rm -f /usr/local/libexec/gcc/arm-apple-darwin/4.0.1/$file; \
/usr/bin/install -c $file /usr/local/libexec/gcc/arm-apple-darwin/4.0.1/$file; \
else true; fi; \
done
for file in ..; do \
if [ x"$file" != x.. ]; then \
rm -f /usr/local/lib/gcc/arm-apple-darwin/4.0.1/$file; \
/usr/bin/install -c -m 644 $file /usr/local/lib/gcc/arm-apple-darwin/4.0.1/$file; \
chmod a-x /usr/local/lib/gcc/arm-apple-darwin/4.0.1/$file; \
else true; fi; \
done
rm -f /usr/local/lib/gcc/arm-apple-darwin/4.0.1/specs
if [ -f protoize ]; then \
rm -f /usr/local/bin/arm-apple-darwin-protoize; \
/usr/bin/install -c protoize /usr/local/bin/arm-apple-darwin-protoize; \
rm -f /usr/local/bin/arm-apple-darwin-unprotoize; \
/usr/bin/install -c unprotoize /usr/local/bin/arm-apple-darwin-unprotoize; \
rm -f /usr/local/lib/gcc/arm-apple-darwin/4.0.1/SYSCALLS.c.X; \
/usr/bin/install -c -m 644 SYSCALLS.c.X /usr/local/lib/gcc/arm-apple-darwin/4.0.1/SYSCALLS.c.X; \
chmod a-x /usr/local/lib/gcc/arm-apple-darwin/4.0.1/SYSCALLS.c.X; \
fi
if [ -f gcov ]; \
then \
rm -f /usr/local/bin/arm-apple-darwin-gcov; \
/usr/bin/install -c gcov /usr/local/bin/arm-apple-darwin-gcov; \
fi
/usr/bin/install -c gccbug /usr/local/bin/arm-apple-darwin-gccbug
rm -rf /usr/local/lib/gcc/arm-apple-darwin/4.0.1/include
mkdir /usr/local/lib/gcc/arm-apple-darwin/4.0.1/include
chmod a+rx /usr/local/lib/gcc/arm-apple-darwin/4.0.1/include
(cd `${PWDCMD-pwd}`/include ; \
tar -cf - .; exit 0) | (cd /usr/local/lib/gcc/arm-apple-darwin/4.0.1/include; tar xpf - )
files=`cd /usr/local/lib/gcc/arm-apple-darwin/4.0.1/include; find . -type l -print 2>/dev/null`; \
if [ $? -eq 0 ]; then \
dir=`cd include; ${PWDCMD-pwd}`; \
for i in $files; do \
dest=`ls -ld /usr/local/lib/gcc/arm-apple-darwin/4.0.1/include/$i | sed -n 's/.*-> //p'`; \
if expr "$dest" : "$dir.*" > /dev/null; then \
rm -f /usr/local/lib/gcc/arm-apple-darwin/4.0.1/include/$i; \
ln -s `echo $i | sed "s|/[^/]*|/..|g" | sed 's|/..$||'``echo "$dest" | sed "s|$dir||"` /usr/local/lib/gcc/arm-apple-darwin/4.0.1/include/$i; \
fi; \
done; \
fi
for file in ../../../llvm-gcc-4.0-iphone/gcc/ginclude/float.h ../../../llvm-gcc-4.0-iphone/gcc/ginclude/iso646.h ../../../llvm-gcc-4.0-iphone/gcc/ginclude/stdarg.h ../../../llvm-gcc-4.0-iphone/gcc/ginclude/stdbool.h ../../../llvm-gcc-4.0-iphone/gcc/ginclude/stddef.h ../../../llvm-gcc-4.0-iphone/gcc/ginclude/tgmath.h ../../../llvm-gcc-4.0-iphone/gcc/ginclude/varargs.h ../../../llvm-gcc-4.0-iphone/gcc/config/arm/mmintrin.h; do \
realfile=`echo $file | sed -e 's|.*/\([^/]*\)$|\1|'`; \
/usr/bin/install -c -m 644 $file \
/usr/local/lib/gcc/arm-apple-darwin/4.0.1/install-tools/include/$realfile ; \
done
/usr/bin/install -c -m 644 xlimits.h /usr/local/lib/gcc/arm-apple-darwin/4.0.1/install-tools/include/limits.h
/usr/bin/install -c -m 644 ../../../llvm-gcc-4.0-iphone/gcc/unwind-generic.h /usr/local/lib/gcc/arm-apple-darwin/4.0.1/install-tools/include/unwind.h
/usr/bin/install -c -m 644 ../../../llvm-gcc-4.0-iphone/gcc/gsyslimits.h \
/usr/local/lib/gcc/arm-apple-darwin/4.0.1/install-tools/gsyslimits.h
/usr/bin/install -c -m 644 macro_list /usr/local/lib/gcc/arm-apple-darwin/4.0.1/install-tools/macro_list
if [ x != x ] ; then \
/usr/bin/install -c /bin/sh ../../../llvm-gcc-4.0-iphone/gcc/../mkinstalldirs \
/usr/local/libexec/gcc/arm-apple-darwin/4.0.1/install-tools/mkinstalldirs ; \
/usr/bin/install -c ../../../llvm-gcc-4.0-iphone/gcc/fixproto /usr/local/libexec/gcc/arm-apple-darwin/4.0.1/install-tools/fixproto ; \
/usr/bin/install -c build/fix-header \
/usr/local/libexec/gcc/arm-apple-darwin/4.0.1/install-tools/fix-header ; \
else :; fi
echo 'SYSTEM_HEADER_DIR="'"/usr/include"'"' \
> /usr/local/lib/gcc/arm-apple-darwin/4.0.1/install-tools/mkheaders.conf
echo 'OTHER_FIXINCLUDES_DIRS=""' \
>> /usr/local/lib/gcc/arm-apple-darwin/4.0.1/install-tools/mkheaders.conf
echo 'FIXPROTO_DEFINES=""' \
>> /usr/local/lib/gcc/arm-apple-darwin/4.0.1/install-tools/mkheaders.conf
echo 'STMP_FIXPROTO=""' \
>> /usr/local/lib/gcc/arm-apple-darwin/4.0.1/install-tools/mkheaders.conf
echo 'STMP_FIXINC="stmp-fixinc"' \
>> /usr/local/lib/gcc/arm-apple-darwin/4.0.1/install-tools/mkheaders.conf
make \
CFLAGS="-g -O2 -W -Wall -Wwrite-strings -Wstrict-prototypes -Wmissing-prototypes -pedantic -Wno-long-long -Wno-variadic-macros -Wold-style-definition " \
CONFIG_H="config.h auto-host.h ../../../llvm-gcc-4.0-iphone/gcc/../include/ansidecl.h" \
MAKEOVERRIDES= \
-f libgcc.mk all
make GCC_FOR_TARGET="/Developer/toolchain/iphone-dev/build/llvm-gcc-4.0-iphone/gcc/xgcc -B/Developer/toolchain/iphone-dev/build/llvm-gcc-4.0-iphone/gcc/ -mmacosx-version-min=10.1 -B/usr/local/arm-apple-darwin/bin/ -B/usr/local/arm-apple-darwin/lib/ -isystem /usr/local/arm-apple-darwin/include -isystem /usr/local/arm-apple-darwin/sys-include" \
AR_FOR_TARGET="arm-apple-darwin-ar" \
AR_CREATE_FOR_TARGET="arm-apple-darwin-ar rc" \
AR_EXTRACT_FOR_TARGET="arm-apple-darwin-ar x" \
AR_FLAGS_FOR_TARGET="" \
CC="gcc" CFLAGS="-g -O2 -W -Wall -Wwrite-strings -Wstrict-prototypes -Wmissing-prototypes -pedantic -Wno-long-long -Wno-variadic-macros -Wold-style-definition " \
BUILD_PREFIX="" \
BUILD_PREFIX_1="loser-" \
LANGUAGES="" \
LIBGCC2_CFLAGS="-O2 -DIN_GCC -W -Wall -Wwrite-strings -Wstrict-prototypes -Wmissing-prototypes -Wold-style-definition -isystem ./include -fPIC -pipe -g -DHAVE_GTHR_DEFAULT -DIN_LIBGCC2 -D__GCC_FLOAT_NOT_NEEDED " \
MULTILIB_CFLAGS="" T= crt3.o
/Developer/toolchain/iphone-dev/build/llvm-gcc-4.0-iphone/gcc/xgcc -B/Developer/toolchain/iphone-dev/build/llvm-gcc-4.0-iphone/gcc/ -mmacosx-version-min=10.1 -B/usr/local/arm-apple-darwin/bin/ -B/usr/local/arm-apple-darwin/lib/ -isystem /usr/local/arm-apple-darwin/include -isystem /usr/local/arm-apple-darwin/sys-include -O2 -DIN_GCC -W -Wall -Wwrite-strings -Wstrict-prototypes -Wmissing-prototypes -Wold-style-definition -isystem ./include -fPIC -pipe -g -DHAVE_GTHR_DEFAULT -DIN_LIBGCC2 -D__GCC_FLOAT_NOT_NEEDED -dynamiclib -nodefaultlibs -install_name /usr/lib/libgcc_s`if test . = ppc64 ; then echo _. ; fi`.1.dylib -single_module -o ./libgcc_s.1.dylib.tmp -Wl,-exported_symbols_list,libgcc/./libgcc.map -compatibility_version 1 -current_version 1.0 libgcc/./_udivsi3_s.o libgcc/./_divsi3_s.o libgcc/./_umodsi3_s.o libgcc/./_modsi3_s.o libgcc/./_dvmd_tls_s.o libgcc/./_muldi3_s.o libgcc/./_negdi2_s.o libgcc/./_lshrdi3_s.o libgcc/./_ashldi3_s.o libgcc/./_ashrdi3_s.o libgcc/./_cmpdi2_s.o libgcc/./_ucmpdi2_s.o libgcc/./_floatdidf_s.o libgcc/./_floatdisf_s.o libgcc/./_fixunsdfsi_s.o libgcc/./_fixunssfsi_s.o libgcc/./_fixunsdfdi_s.o libgcc/./_fixdfdi_s.o libgcc/./_fixunssfdi_s.o libgcc/./_fixsfdi_s.o libgcc/./_fixxfdi_s.o libgcc/./_fixunsxfdi_s.o libgcc/./_floatdixf_s.o libgcc/./_fixunsxfsi_s.o libgcc/./_fixtfdi_s.o libgcc/./_fixunstfdi_s.o libgcc/./_floatditf_s.o libgcc/./_clear_cache_s.o libgcc/./_enable_execute_stack_s.o libgcc/./_trampoline_s.o libgcc/./__main_s.o libgcc/./_absvsi2_s.o libgcc/./_absvdi2_s.o libgcc/./_addvsi3_s.o libgcc/./_addvdi3_s.o libgcc/./_subvsi3_s.o libgcc/./_subvdi3_s.o libgcc/./_mulvsi3_s.o libgcc/./_mulvdi3_s.o libgcc/./_negvsi2_s.o libgcc/./_negvdi2_s.o libgcc/./_ctors_s.o libgcc/./_ffssi2_s.o libgcc/./_ffsdi2_s.o libgcc/./_clz_s.o libgcc/./_clzsi2_s.o libgcc/./_clzdi2_s.o libgcc/./_ctzsi2_s.o libgcc/./_ctzdi2_s.o libgcc/./_popcount_tab_s.o libgcc/./_popcountsi2_s.o libgcc/./_popcountdi2_s.o libgcc/./_paritysi2_s.o libgcc/./_paritydi2_s.o libgcc/./_powisf2_s.o libgcc/./_powidf2_s.o libgcc/./_powixf2_s.o libgcc/./_powitf2_s.o libgcc/./_mulsc3_s.o libgcc/./_muldc3_s.o libgcc/./_mulxc3_s.o libgcc/./_multc3_s.o libgcc/./_divsc3_s.o libgcc/./_divdc3_s.o libgcc/./_divxc3_s.o libgcc/./_divtc3_s.o libgcc/./_divdi3_s.o libgcc/./_moddi3_s.o libgcc/./_udivdi3_s.o libgcc/./_umoddi3_s.o libgcc/./_udiv_w_sdiv_s.o libgcc/./_udivmoddi4_s.o libgcc/./unwind-dw2_s.o libgcc/./unwind-dw2-fde-darwin_s.o libgcc/./unwind-sjlj_s.o libgcc/./unwind-c_s.o -lc
/usr/local/bin/arm-apple-darwin-ld: warning fat file: /usr/local/share/iphone-filesystem/usr/local/arm-apple-darwin/lib/dylib1.o does not contain an architecture that matches the specified -arch flag: arm (file ignored)
/usr/local/bin/arm-apple-darwin-ld: warning fat file: /usr/local/share/iphone-filesystem/usr/local/arm-apple-darwin/lib/libc.dylib does not contain an architecture that matches the specified -arch flag: arm (file ignored)
/usr/local/bin/arm-apple-darwin-ld: Undefined symbols:
dyld_stub_binding_helper
_abort
_copysignl
__keymgr_get_and_lock_processwide_ptr
__keymgr_set_and_unlock_processwide_ptr
__keymgr_unlock_processwide_ptr
_calloc
_free
_getsectdatafromheader
_malloc
_strlen
_longjmp
_pthread_getspecific
_pthread_key_create
_pthread_once
_pthread_setspecific
collect2: ld returned 1 exit status
make[2]: *** [libgcc_s.dylib] Error 1
make[1]: *** [stmp-multilib] Error 2
make: *** [install-gcc] Error 2