rendered paste body...
...
/bin/sh ../../../../libtool --silent --tag=CXX --mode=compile g++ -DHAVE_CONFIG_H -I. -I../../../.. -I/opt/kde/include -I/opt/qt/include -I. -I/usr/include/taglib -DQT_THREAD_SUPPORT -D_REENTRANT -Wno-long-long -Wundef -ansi -D_XOPEN_SOURCE=500 -D_BSD_SOURCE -Wcast-align -Wchar-subscripts -Wall -W -Wpointer-arith -DNDEBUG -DNO_DEBUG -O2 -march=i686 -mtune=generic -O2 -pipe -Wformat-security -Wmissing-format-attribute -Wno-non-virtual-dtor -fno-exceptions -fno-check-new -fno-common -DQT_CLEAN_NAMESPACE -DQT_NO_ASCII_CAST -DQT_NO_STL -DQT_NO_COMPAT -DQT_NO_TRANSLATION -MT taglib_realmediafile.lo -MD -MP -MF .deps/taglib_realmediafile.Tpo -c -o taglib_realmediafile.lo taglib_realmediafile.cpp
In file included from taglib_realmediafile.cpp:37:
rmff.h: In constructor 'TagLib::RealMedia::MediaProperties::MediaProperties()':
rmff.h:166: error: 'memset' was not declared in this scope
rmff.h: At global scope:
rmff.h:279: warning: declaration 'class TagLib::AudioProperties' does not declare anything
taglib_realmediafile.cpp: In member function 'void TagLib::RealMedia::Tag::duplicate(const TagLib::RealMedia::Tag*, TagLib::RealMedia::Tag*, bool)':
taglib_realmediafile.cpp:146: warning: suggest explicit braces to avoid ambiguous 'else'
make[6]: *** [taglib_realmediafile.lo] Error 1
make[6]: Leaving directory `/usr/local/src/builds/amarok/src/multimedia-build/amarok/src/metadata/rmff'
make[5]: *** [all-recursive] Error 1
make[5]: Leaving directory `/usr/local/src/builds/amarok/src/multimedia-build/amarok/src/metadata/rmff'
make[4]: *** [all-recursive] Error 1
make[4]: Leaving directory `/usr/local/src/builds/amarok/src/multimedia-build/amarok/src/metadata'
make[3]: *** [all-recursive] Error 1
make[3]: Leaving directory `/usr/local/src/builds/amarok/src/multimedia-build/amarok/src'
make[2]: *** [all-recursive] Error 1
make[2]: Leaving directory `/usr/local/src/builds/amarok/src/multimedia-build/amarok'
make[1]: *** [all-recursive] Error 1
make[1]: Leaving directory `/usr/local/src/builds/amarok/src/multimedia-build'
make: *** [all] Error 2
==> ERROR: Build Failed.
Aborting...