All pastes #961057 Raw Edit

Untitled

public text v1 · immutable
#961057 ·published 2008-03-28 17:24 UTC
rendered paste body
-- Found Qt-Version 4.4.0-snapshot-20080214 (using /home/harry/qt-copy/bin/qmake)
-- Found X11: /usr/lib/libX11.so
-- Found KDE 4.1 include dir: /home/harry/kde/include
-- Found KDE 4.1 library dir: /home/harry/kde/lib
-- Found KDE4 kconfig_compiler preprocessor: /home/harry/kde/bin/kconfig_compiler
-- Found KDE4 automoc: /home/harry/kde/bin/kde4automoc
-- Configuring done
-- Generating done
-- Build files have been written to: /home/harry/kde/build/playground/base/plasma/applets/worldclock
/usr/bin/cmake -H/home/harry/kde/src/playground/base/plasma/applets/worldclock -B/home/harry/kde/build/playground/base/plasma/applets/worldclock --check-build-system CMakeFiles/Makefile.cmake 0
/usr/bin/cmake -E cmake_progress_start /home/harry/kde/build/playground/base/plasma/applets/worldclock/CMakeFiles 3
make -f CMakeFiles/Makefile2 all
make[1]: Entering directory `/home/harry/kde/build/playground/base/plasma/applets/worldclock'
make -f CMakeFiles/plasma_applet_worldclock.dir/build.make CMakeFiles/plasma_applet_worldclock.dir/depend
make[2]: Entering directory `/home/harry/kde/build/playground/base/plasma/applets/worldclock'
/usr/bin/cmake -E cmake_progress_report /home/harry/kde/build/playground/base/plasma/applets/worldclock/CMakeFiles 3
[ 33%] Generating plasma_applet_worldclock_automoc.cpp
/home/harry/kde/bin/kde4automoc /home/harry/kde/build/playground/base/plasma/applets/worldclock/plasma_applet_worldclock_automoc.cpp /home/harry/kde/src/playground/base/plasma/applets/worldclock /home/harry/kde/build/playground/base/plasma/applets/worldclock /home/harry/qt-copy/bin/moc
Generating worldclock.moc
Scanning dependencies of target plasma_applet_worldclock
cd /home/harry/kde/build/playground/base/plasma/applets/worldclock && /usr/bin/cmake -E cmake_depends "KDevelop3" /home/harry/kde/src/playground/base/plasma/applets/worldclock /home/harry/kde/src/playground/base/plasma/applets/worldclock /home/harry/kde/build/playground/base/plasma/applets/worldclock /home/harry/kde/build/playground/base/plasma/applets/worldclock /home/harry/kde/build/playground/base/plasma/applets/worldclock/CMakeFiles/plasma_applet_worldclock.dir/DependInfo.cmake
make[2]: Leaving directory `/home/harry/kde/build/playground/base/plasma/applets/worldclock'
make -f CMakeFiles/plasma_applet_worldclock.dir/build.make CMakeFiles/plasma_applet_worldclock.dir/build
make[2]: Entering directory `/home/harry/kde/build/playground/base/plasma/applets/worldclock'
/usr/bin/cmake -E cmake_progress_report /home/harry/kde/build/playground/base/plasma/applets/worldclock/CMakeFiles 1
[ 66%] /usr/bin/cmake -E cmake_progress_report /home/harry/kde/build/playground/base/plasma/applets/worldclock/CMakeFiles 2
Building CXX object CMakeFiles/plasma_applet_worldclock.dir/plasma_applet_worldclock_automoc.o
[100%] /usr/lib/icecc/bin/c++   -Dplasma_applet_worldclock_EXPORTS  -pipe -O2 -march=nocona   -Wnon-virtual-dtor -Wno-long-long -ansi -Wundef -Wcast-align -Wchar-subscripts -Wall -W -Wpointer-arith -Wformat-security -fno-exceptions -fno-check-new -fno-common -Woverloaded-virtual -fvisibility=hidden -g3 -fno-inline -fPIC -I/home/harry/kde/build/playground/base/plasma/applets/worldclock -I/home/harry/kde/src/playground/base/plasma/applets/worldclock -I/home/harry/kde/include -I/home/harry/kde/include/KDE -I/home/harry/qt-copy/include/QtDBus -I/home/harry/qt-copy/include/QtTest -I/home/harry/qt-copy/include/QtUiTools -I/home/harry/qt-copy/include/QtScript -I/home/harry/qt-copy/include/QtSvg -I/home/harry/qt-copy/include/QtXml -I/home/harry/qt-copy/include/QtSql -I/home/harry/qt-copy/include/QtOpenGL -I/home/harry/qt-copy/include/QtNetwork -I/home/harry/qt-copy/include/QtDesigner -I/home/harry/qt-copy/include/QtAssistant -I/home/harry/qt-copy/include/Qt3Support -I/home/harry/qt-copy/include/QtGui -I/home/harry/qt-copy/include/QtCore -I/home/harry/qt-copy/include/Qt -I/home/harry/qt-copy/mkspecs/default -I/home/harry/qt-copy/include   -DQT3_SUPPORT -DQT3_SUPPORT_WARNINGS -D_BSD_SOURCE -D_XOPEN_SOURCE=500 -D_BSD_SOURCE -D_GNU_SOURCE -DQT_NO_STL -DQT_NO_CAST_TO_ASCII -D_REENTRANT -DKDE_DEPRECATED_WARNINGS -o CMakeFiles/plasma_applet_worldclock.dir/plasma_applet_worldclock_automoc.o -c /home/harry/kde/build/playground/base/plasma/applets/worldclock/plasma_applet_worldclock_automoc.cpp
Building CXX object CMakeFiles/plasma_applet_worldclock.dir/worldclock.o
/usr/lib/icecc/bin/c++   -Dplasma_applet_worldclock_EXPORTS  -pipe -O2 -march=nocona   -Wnon-virtual-dtor -Wno-long-long -ansi -Wundef -Wcast-align -Wchar-subscripts -Wall -W -Wpointer-arith -Wformat-security -fno-exceptions -fno-check-new -fno-common -Woverloaded-virtual -fvisibility=hidden -g3 -fno-inline -fPIC -I/home/harry/kde/build/playground/base/plasma/applets/worldclock -I/home/harry/kde/src/playground/base/plasma/applets/worldclock -I/home/harry/kde/include -I/home/harry/kde/include/KDE -I/home/harry/qt-copy/include/QtDBus -I/home/harry/qt-copy/include/QtTest -I/home/harry/qt-copy/include/QtUiTools -I/home/harry/qt-copy/include/QtScript -I/home/harry/qt-copy/include/QtSvg -I/home/harry/qt-copy/include/QtXml -I/home/harry/qt-copy/include/QtSql -I/home/harry/qt-copy/include/QtOpenGL -I/home/harry/qt-copy/include/QtNetwork -I/home/harry/qt-copy/include/QtDesigner -I/home/harry/qt-copy/include/QtAssistant -I/home/harry/qt-copy/include/Qt3Support -I/home/harry/qt-copy/include/QtGui -I/home/harry/qt-copy/include/QtCore -I/home/harry/qt-copy/include/Qt -I/home/harry/qt-copy/mkspecs/default -I/home/harry/qt-copy/include   -DQT3_SUPPORT -DQT3_SUPPORT_WARNINGS -D_BSD_SOURCE -D_XOPEN_SOURCE=500 -D_BSD_SOURCE -D_GNU_SOURCE -DQT_NO_STL -DQT_NO_CAST_TO_ASCII -D_REENTRANT -DKDE_DEPRECATED_WARNINGS -o CMakeFiles/plasma_applet_worldclock.dir/worldclock.o -c /home/harry/kde/src/playground/base/plasma/applets/worldclock/worldclock.cpp
In file included from /home/harry/kde/src/playground/base/plasma/applets/worldclock/worldclock.cpp:34:
/home/harry/kde/src/playground/base/plasma/applets/worldclock/worldclock.h:23:33: error: ui_worldclockConfig.h: No such file or directory
/home/harry/kde/src/playground/base/plasma/applets/worldclock/worldclock.h:52: error: ‘Ui’ has not been declared
/home/harry/kde/src/playground/base/plasma/applets/worldclock/worldclock.h:52: error: ISO C++ forbids declaration of ‘worldclockConfig’ with no type
/home/harry/kde/src/playground/base/plasma/applets/worldclock/worldclock.h:52: error: expected ‘;’ before ‘ui’
/home/harry/kde/src/playground/base/plasma/applets/worldclock/worldclock.cpp: In constructor ‘WorldClock::WorldClock(QObject*, const QVariantList&)’:
/home/harry/kde/src/playground/base/plasma/applets/worldclock/worldclock.cpp:52: error: ‘cg’ was not declared in this scope
/home/harry/kde/src/playground/base/plasma/applets/worldclock/worldclock.cpp: In member function ‘void WorldClock::resizeMap()’:
/home/harry/kde/src/playground/base/plasma/applets/worldclock/worldclock.cpp:104: warning: passing ‘qreal’ for argument 1 to ‘void MarbleMap::setSize(int, int)’
/home/harry/kde/src/playground/base/plasma/applets/worldclock/worldclock.cpp:104: warning: passing ‘qreal’ for argument 2 to ‘void MarbleMap::setSize(int, int)’
/home/harry/kde/src/playground/base/plasma/applets/worldclock/worldclock.cpp:107: warning: passing ‘qreal’ for argument 1 to ‘void MarbleMap::setRadius(int)’
/home/harry/kde/src/playground/base/plasma/applets/worldclock/worldclock.cpp: At global scope:
/home/harry/kde/src/playground/base/plasma/applets/worldclock/worldclock.cpp:113: warning: unused parameter ‘name’
/home/harry/kde/src/playground/base/plasma/applets/worldclock/worldclock.cpp:113: warning: unused parameter ‘data’
/home/harry/kde/src/playground/base/plasma/applets/worldclock/worldclock.cpp:121: warning: unused parameter ‘option’
/home/harry/kde/src/playground/base/plasma/applets/worldclock/worldclock.cpp: In member function ‘virtual void WorldClock::showConfigurationInterface()’:
/home/harry/kde/src/playground/base/plasma/applets/worldclock/worldclock.cpp:138: error: ‘ui’ was not declared in this scope
/home/harry/kde/src/playground/base/plasma/applets/worldclock/worldclock.cpp:143: error: ‘cg’ was not declared in this scope
/home/harry/kde/src/playground/base/plasma/applets/worldclock/worldclock.cpp: At global scope:
/home/harry/kde/src/playground/base/plasma/applets/worldclock/worldclock.cpp:155: error: ‘CiaVc’ has not been declared
/home/harry/kde/src/playground/base/plasma/applets/worldclock/worldclock.cpp: In function ‘void configAccepted()’:
/home/harry/kde/src/playground/base/plasma/applets/worldclock/worldclock.cpp:157: error: ‘config’ was not declared in this scope
/home/harry/kde/src/playground/base/plasma/applets/worldclock/worldclock.cpp:158: error: ‘ui’ was not declared in this scope
/home/harry/kde/src/playground/base/plasma/applets/worldclock/worldclock.cpp:162: error: ‘m_sun’ was not declared in this scope
/home/harry/kde/src/playground/base/plasma/applets/worldclock/worldclock.cpp:168: error: ‘m_sun’ was not declared in this scope
/home/harry/kde/src/playground/base/plasma/applets/worldclock/worldclock.cpp:169: error: ‘m_map’ was not declared in this scope
/home/harry/kde/src/playground/base/plasma/applets/worldclock/worldclock.cpp:170: error: ‘update’ was not declared in this scope
/home/harry/kde/src/playground/base/plasma/applets/worldclock/worldclock.cpp:172: error: ‘ui’ was not declared in this scope
/home/harry/kde/src/playground/base/plasma/applets/worldclock/worldclock.cpp:174: error: ‘m_map’ was not declared in this scope
/home/harry/kde/src/playground/base/plasma/applets/worldclock/worldclock.cpp:175: error: ‘update’ was not declared in this scope
/home/harry/kde/src/playground/base/plasma/applets/worldclock/worldclock.cpp:177: error: ‘ui’ was not declared in this scope
/home/harry/kde/include/conversion_check.h: In member function ‘void ConversionCheck::type_toQVariant<T>::constraint() [with T = Qt::CheckState]’:
/home/harry/kde/include/conversion_check.h:78:   instantiated from ‘void ConversionCheck::to_QVariant() [with T = Qt::CheckState]’
/home/harry/kde/include/kconfiggroup.h:643:   instantiated from ‘T KConfigGroup::readCheck(const char*, const T&) const [with T = Qt::CheckState]’
/home/harry/kde/include/kconfiggroup.h:198:   instantiated from ‘T KConfigGroup::readEntry(const char*, const T&) const [with T = Qt::CheckState]’
/home/harry/kde/src/playground/base/plasma/applets/worldclock/worldclock.cpp:159:   instantiated from here
/home/harry/kde/include/conversion_check.h:60: error: conversion from ‘ConversionCheck::unsupported’ to non-scalar type ‘ConversionCheck::supported’ requested
/home/harry/qt-copy/include/QtCore/qmetatype.h: In static member function ‘static int QMetaTypeId2<T>::qt_metatype_id() [with T = Qt::CheckState]’:
/home/harry/qt-copy/include/QtCore/qmetatype.h:201:   instantiated from ‘int qMetaTypeId(T*) [with T = Qt::CheckState]’
/home/harry/qt-copy/include/QtCore/qvariant.h:433:   instantiated from ‘QVariant qVariantFromValue(const T&) [with T = Qt::CheckState]’
/home/harry/kde/include/kconfiggroup.h:644:   instantiated from ‘T KConfigGroup::readCheck(const char*, const T&) const [with T = Qt::CheckState]’
/home/harry/kde/include/kconfiggroup.h:198:   instantiated from ‘T KConfigGroup::readEntry(const char*, const T&) const [with T = Qt::CheckState]’
/home/harry/kde/src/playground/base/plasma/applets/worldclock/worldclock.cpp:159:   instantiated from here
/home/harry/qt-copy/include/QtCore/qmetatype.h:191: error: ‘qt_metatype_id’ is not a member of ‘QMetaTypeId<Qt::CheckState>’
/home/harry/kde/include/marble/global.h: At global scope:
/home/harry/kde/include/marble/global.h:93: warning: ‘NOT_AVAILABLE’ defined but not used
make[2]: *** [CMakeFiles/plasma_applet_worldclock.dir/worldclock.o] Error 1
make[2]: Leaving directory `/home/harry/kde/build/playground/base/plasma/applets/worldclock'
make[1]: *** [CMakeFiles/plasma_applet_worldclock.dir/all] Error 2
make[1]: Leaving directory `/home/harry/kde/build/playground/base/plasma/applets/worldclock'
make: *** [all] Error 2