All pastes #960161 Raw Edit

Stuff

public text v1 · immutable
#960161 ·published 2008-03-27 22:26 UTC
rendered paste body
In file included from EphyBrowser.cpp:30:
/usr/include/xulrunner-1.9b4/unstable/./gtkmozembed.h:57:1: warning: "NS_HIDDEN" redefined
In file included from /usr/include/xulrunner-1.9b4/unstable/./nsXPCOMStrings.h:42,
                 from /usr/include/xulrunner-1.9b4/unstable/./nsStringAPI.h:52,
                 from EphyBrowser.cpp:28:
/usr/include/xulrunner-1.9b4/unstable/./nscore.h:117:1: warning: this is the location of the previous definition
In file included from EphyBrowser.cpp:30:
/usr/include/xulrunner-1.9b4/unstable/./gtkmozembed.h:63:1: warning: "NS_EXPORT_" redefined
In file included from /usr/include/xulrunner-1.9b4/unstable/./nsXPCOMStrings.h:42,
                 from /usr/include/xulrunner-1.9b4/unstable/./nsStringAPI.h:52,
                 from EphyBrowser.cpp:28:
/usr/include/xulrunner-1.9b4/unstable/./nscore.h:208:1: warning: this is the location of the previous definition
In file included from EphyBrowser.cpp:30:
/usr/include/xulrunner-1.9b4/unstable/./gtkmozembed.h:64:1: warning: "NS_IMPORT_" redefined
In file included from /usr/include/xulrunner-1.9b4/unstable/./nsXPCOMStrings.h:42,
                 from /usr/include/xulrunner-1.9b4/unstable/./nsStringAPI.h:52,
                 from EphyBrowser.cpp:28:
/usr/include/xulrunner-1.9b4/unstable/./nscore.h:206:1: warning: this is the location of the previous definition
In file included from EphyBrowser.cpp:108:
../../lib/ephy-zoom.h:50: warning: deprecated conversion from string constant to 'gchar*'
../../lib/ephy-zoom.h:50: warning: deprecated conversion from string constant to 'gchar*'
../../lib/ephy-zoom.h:50: warning: deprecated conversion from string constant to 'gchar*'
../../lib/ephy-zoom.h:50: warning: deprecated conversion from string constant to 'gchar*'
../../lib/ephy-zoom.h:50: warning: deprecated conversion from string constant to 'gchar*'
../../lib/ephy-zoom.h:50: warning: deprecated conversion from string constant to 'gchar*'
../../lib/ephy-zoom.h:50: warning: deprecated conversion from string constant to 'gchar*'
../../lib/ephy-zoom.h:50: warning: deprecated conversion from string constant to 'gchar*'
../../lib/ephy-zoom.h:50: warning: deprecated conversion from string constant to 'gchar*'
In file included from EphyBrowser.cpp:118:
./ephyIAddCertExceptionParams.h:25: error: function definition does not declare parameters
./ephyIAddCertExceptionParams.h:42: error: 'ephyIAddCertExceptionParams' has not been declared
./ephyIAddCertExceptionParams.h:42: error: expected initializer before '<' token
EphyBrowser.cpp:135: error: expected class-name before ',' token
EphyBrowser.cpp:142: error: field 'nsresult' has incomplete type
EphyBrowser.cpp:142: error: expected ';' before 'GetPrefetchCert'
EphyBrowser.cpp:142: error: field 'nsresult' has incomplete type
EphyBrowser.cpp:142: error: expected ';' before 'GetLocation'
EphyBrowser.cpp:142: error: field 'nsresult' has incomplete type
EphyBrowser.cpp:142: error: expected ';' before 'GetExceptionAdded'
EphyBrowser.cpp:142: error: field 'nsresult' has incomplete type
EphyBrowser.cpp:142: error: expected ';' before 'SetExceptionAdded'
EphyBrowser.cpp: In member function 'virtual nsresult EphyAddCertExceptionParams::QueryInterface(const nsIID&, void**)':
EphyBrowser.cpp:161: error: 'ephyIAddCertExceptionParams' has not been declared
EphyBrowser.cpp:161: error: expected primary-expression before 'int'
EphyBrowser.cpp:161: error: expected `}' before 'int'
EphyBrowser.cpp:161: error: expected `}' before 'int'
EphyBrowser.cpp:161: error: expected ',' or ';' before 'int'
EphyBrowser.cpp:161: warning: unused variable 'rv'
EphyBrowser.cpp:161: warning: unused variable 'table'
EphyBrowser.cpp: At global scope:
EphyBrowser.cpp:161: error: mixing declarations and function-definitions is forbidden
EphyBrowser.cpp:161: error: expected unqualified-id before '{' token
EphyBrowser.cpp:161: error: expected unqualified-id before ',' token
EphyBrowser.cpp:161: error: expected unqualified-id before '{' token
EphyBrowser.cpp:161: error: expected unqualified-id before ',' token
EphyBrowser.cpp:161: error: expected unqualified-id before '{' token
EphyBrowser.cpp:161: error: expected unqualified-id before ',' token
EphyBrowser.cpp:161: error: expected unqualified-id before '{' token
EphyBrowser.cpp:161: error: expected declaration before '}' token
make[4]: *** [libephymozillaembed_la-EphyBrowser.lo] Error 1
make[4]: Leaving directory `/home/diego/gnome/src/epiphany/embed/mozilla'
make[3]: *** [all-recursive] Error 1
make[3]: Leaving directory `/home/diego/gnome/src/epiphany/embed'
make[2]: *** [all] Error 2
make[2]: Leaving directory `/home/diego/gnome/src/epiphany/embed'
make[1]: *** [all-recursive] Error 1
make[1]: Leaving directory `/home/diego/gnome/src/epiphany'
make: *** [all] Error 2
*** error during stage build of epiphany: ########## Error running make   *** [1/2]