rendered paste body/bin/sh /var/tmp/portage/sys-devel/gcc-4.3.0/work/gcc-4.3.0/gcc/../move-if-change tmp-options.h options.h
echo timestamp > s-options-h
TARGET_CPU_DEFAULT="" \
HEADERS="auto-host.h ansidecl.h" DEFINES="" \
/bin/sh /var/tmp/portage/sys-devel/gcc-4.3.0/work/gcc-4.3.0/gcc/mkconfig.sh bconfig.h
x86_64-pc-linux-gnu-gcc -c -O -DIN_GCC -W -Wall -Wwrite-strings -Wstrict-prototypes -Wmissing-prototypes -Wold-style-definition -Wmissing-format-attribute -pedantic -Wno-long-long -Wno-variadic-macros -Wno-overlength-strings -fno-common -DHAVE_CONFIG_H -DGENERATOR_FILE -I. -Ibuild -I/var/tmp/portage/sys-devel/gcc-4.3.0/work/gcc-4.3.0/gcc -I/var/tmp/portage/sys-devel/gcc-4.3.0/work/gcc-4.3.0/gcc/build -I/var/tmp/portage/sys-devel/gcc-4.3.0/work/gcc-4.3.0/gcc/../include -I/var/tmp/portage/sys-devel/gcc-4.3.0/work/gcc-4.3.0/gcc/../libcpp/include -I/var/tmp/portage/sys-devel/gcc-4.3.0/work/gcc-4.3.0/gcc/../libdecnumber -I/var/tmp/portage/sys-devel/gcc-4.3.0/work/gcc-4.3.0/gcc/../libdecnumber/bid -I../libdecnumber -o build/genmodes.o /var/tmp/portage/sys-devel/gcc-4.3.0/work/gcc-4.3.0/gcc/genmodes.c
x86_64-pc-linux-gnu-gcc -c -O -DIN_GCC -W -Wall -Wwrite-strings -Wstrict-prototypes -Wmissing-prototypes -Wold-style-definition -Wmissing-format-attribute -pedantic -Wno-long-long -Wno-variadic-macros -Wno-overlength-strings -fno-common -DHAVE_CONFIG_H -DGENERATOR_FILE -I. -Ibuild -I/var/tmp/portage/sys-devel/gcc-4.3.0/work/gcc-4.3.0/gcc -I/var/tmp/portage/sys-devel/gcc-4.3.0/work/gcc-4.3.0/gcc/build -I/var/tmp/portage/sys-devel/gcc-4.3.0/work/gcc-4.3.0/gcc/../include -I/var/tmp/portage/sys-devel/gcc-4.3.0/work/gcc-4.3.0/gcc/../libcpp/include -I/var/tmp/portage/sys-devel/gcc-4.3.0/work/gcc-4.3.0/gcc/../libdecnumber -I/var/tmp/portage/sys-devel/gcc-4.3.0/work/gcc-4.3.0/gcc/../libdecnumber/bid -I../libdecnumber -o build/errors.o /var/tmp/portage/sys-devel/gcc-4.3.0/work/gcc-4.3.0/gcc/errors.c
x86_64-pc-linux-gnu-gcc -O -DIN_GCC -W -Wall -Wwrite-strings -Wstrict-prototypes -Wmissing-prototypes -Wold-style-definition -Wmissing-format-attribute -pedantic -Wno-long-long -Wno-variadic-macros -Wno-overlength-strings -fno-common -DHAVE_CONFIG_H -DGENERATOR_FILE -Wl,--as-needed -o build/genmodes \
build/genmodes.o build/errors.o ../build-x86_64-pc-linux-gnu/libiberty/libiberty.a
build/genmodes -h > tmp-modes.h
/bin/sh /var/tmp/portage/sys-devel/gcc-4.3.0/work/gcc-4.3.0/gcc/../move-if-change tmp-modes.h insn-modes.h
echo timestamp > s-modes-h
x86_64-pc-linux-gnu-gcc -c -O -DIN_GCC -W -Wall -Wwrite-strings -Wstrict-prototypes -Wmissing-prototypes -Wold-style-definition -Wmissing-format-attribute -pedantic -Wno-long-long -Wno-variadic-macros -Wno-overlength-strings -fno-common -DHAVE_CONFIG_H -DGENERATOR_FILE -I. -Ibuild -I/var/tmp/portage/sys-devel/gcc-4.3.0/work/gcc-4.3.0/gcc -I/var/tmp/portage/sys-devel/gcc-4.3.0/work/gcc-4.3.0/gcc/build -I/var/tmp/portage/sys-devel/gcc-4.3.0/work/gcc-4.3.0/gcc/../include -I/var/tmp/portage/sys-devel/gcc-4.3.0/work/gcc-4.3.0/gcc/../libcpp/include -I/var/tmp/portage/sys-devel/gcc-4.3.0/work/gcc-4.3.0/gcc/../libdecnumber -I/var/tmp/portage/sys-devel/gcc-4.3.0/work/gcc-4.3.0/gcc/../libdecnumber/bid -I../libdecnumber -o build/genconstants.o /var/tmp/portage/sys-devel/gcc-4.3.0/work/gcc-4.3.0/gcc/genconstants.c
In file included from ./tm.h:8,
from /var/tmp/portage/sys-devel/gcc-4.3.0/work/gcc-4.3.0/gcc/genconstants.c:32:
./options.h:491: error: redeclaration of enumerator ‘OP___’
./options.h:490: error: previous definition of ‘OP___’ was here
./options.h:1090: error: redeclaration of enumerator ‘OP__f_rap_’
./options.h:1031: error: previous definition of ‘OP__f_rap_’ was here
./options.h:1221: error: redeclaration of enumerator ‘OP___’
./options.h:491: error: previous definition of ‘OP___’ was here
./options.h:1223: error: redeclaration of enumerator ‘OP___’
./options.h:1221: error: previous definition of ‘OP___’ was here
./options.h:1224: error: redeclaration of enumerator ‘OP___’
./options.h:1223: error: previous definition of ‘OP___’ was here
make[3]: *** [build/genconstants.o] Error 1
make[3]: Leaving directory `/var/tmp/portage/sys-devel/gcc-4.3.0/work/build/gcc'
make[2]: *** [all-stage1-gcc] Error 2
make[2]: Leaving directory `/var/tmp/portage/sys-devel/gcc-4.3.0/work/build'
make[1]: *** [stage1-bubble] Error 2
make[1]: Leaving directory `/var/tmp/portage/sys-devel/gcc-4.3.0/work/build'
make: *** [profiledbootstrap] Error 2
*
* ERROR: sys-devel/gcc-4.3.0 failed.
* Call stack:
* ebuild.sh, line 49: Called src_compile
* environment, line 4599: Called toolchain_src_compile
* environment, line 5068: Called gcc_src_compile
* environment, line 2926: Called gcc_do_make
* environment, line 2756: Called die
* The specific snippet of code:
* emake LDFLAGS="${LDFLAGS}" STAGE1_CFLAGS="${STAGE1_CFLAGS}" LIBPATH="${LIBPATH}" BOOT_CFLAGS="${BOOT_CFLAGS}" ${GCC_MAKE_TARGET} || die "emake failed with ${GCC_MAKE_TARGET}";
* The die message:
* emake failed with profiledbootstrap
*
* If you need support, post the topmost build error, and the call stack if relevant.
* A complete build log is located at '/var/tmp/portage/sys-devel/gcc-4.3.0/temp/build.log'.
* The ebuild environment file is located at '/var/tmp/portage/sys-devel/gcc-4.3.0/temp/environment'.
*