All pastes #95827 Raw Edit

Zen_X

public text v1 · immutable
#95827 ·published 2006-07-22 10:39 UTC
rendered paste body
Good - your configure finished. Start make now

make  all-recursive
make[1]: Entering directory `/var/tmp/portage/amarok-1.4.1-r2/work/amarok-1.4.1'
Making all in amarok
make[2]: Entering directory `/var/tmp/portage/amarok-1.4.1-r2/work/amarok-1.4.1/amarok'
Making all in src
make[3]: Entering directory `/var/tmp/portage/amarok-1.4.1-r2/work/amarok-1.4.1/amarok/src'
Making all in amarokcore
make[4]: Entering directory `/var/tmp/portage/amarok-1.4.1-r2/work/amarok-1.4.1/amarok/src/amarokcore'
/usr/kde/3.5/bin/kconfig_compiler ./amarok.kcfg ./amarokconfig.kcfgc; ret=$?; \
        if test "$ret" != 0; then rm -f amarokconfig.h ; exit $ret ;  fi
/usr/qt/3/bin/moc ./amarokdcophandler.h -o amarokdcophandler.moc
/usr/kde/3.5/bin/dcopidl ./amarokdcopiface.h > amarokdcopiface.kidl || ( rm -f amarokdcopiface.kidl ; false )
/bin/sh ../../../libtool --silent --tag=CXX --mode=compile i686-pc-linux-gnu-g++ -DHAVE_CONFIG_H -I. -I. -I../../.. -I../../../amarok/src -I../../../amarok/src/amarokcore -I../../../amarok/src -I../../../amarok/src/engine -I../../../amarok/src/plugin -I../../../amarok/src/statusbar -I../../../amarok/src/mediadevice -I/usr/kde/3.5/include -I/usr/qt/3/include -I.  -I/usr/kde/3.5/include  -DQT_THREAD_SUPPORT  -D_REENTRANT  -Wno-long-long -Wundef -ansi -D_XOPEN_SOURCE=500 -D_BSD_SOURCE -Wcast-align -Wconversion -Wchar-subscripts -Wall -W -Wpointer-arith -DNDEBUG -DNO_DEBUG -O2 -march=athlon-xp -pipe -O2 -fno-inline -Wformat-security -Wmissing-format-attribute -Wno-non-virtual-dtor -fno-exceptions -fno-check-new -fno-common -DQT_CLEAN_NAMESPACE -DQT_NO_ASCII_CAST -DQT_NO_STL -DQT_NO_COMPAT -DQT_NO_TRANSLATION  -c -o amarokconfig.lo amarokconfig.cpp
/bin/sh ../../../libtool --silent --tag=CXX --mode=compile i686-pc-linux-gnu-g++ -DHAVE_CONFIG_H -I. -I. -I../../.. -I../../../amarok/src -I../../../amarok/src/amarokcore -I../../../amarok/src -I../../../amarok/src/engine -I../../../amarok/src/plugin -I../../../amarok/src/statusbar -I../../../amarok/src/mediadevice -I/usr/kde/3.5/include -I/usr/qt/3/include -I.  -I/usr/kde/3.5/include  -DQT_THREAD_SUPPORT  -D_REENTRANT  -Wno-long-long -Wundef -ansi -D_XOPEN_SOURCE=500 -D_BSD_SOURCE -Wcast-align -Wconversion -Wchar-subscripts -Wall -W -Wpointer-arith -DNDEBUG -DNO_DEBUG -O2 -march=athlon-xp -pipe -O2 -fno-inline -Wformat-security -Wmissing-format-attribute -Wno-non-virtual-dtor -fno-exceptions -fno-check-new -fno-common -DQT_CLEAN_NAMESPACE -DQT_NO_ASCII_CAST -DQT_NO_STL -DQT_NO_COMPAT -DQT_NO_TRANSLATION  -c -o amarokdcophandler.lo amarokdcophandler.cpp
/bin/sh ../../../libtool --silent --tag=CXX --mode=compile i686-pc-linux-gnu-g++ -DHAVE_CONFIG_H -I. -I. -I../../.. -I../../../amarok/src -I../../../amarok/src/amarokcore -I../../../amarok/src -I../../../amarok/src/engine -I../../../amarok/src/plugin -I../../../amarok/src/statusbar -I../../../amarok/src/mediadevice -I/usr/kde/3.5/include -I/usr/qt/3/include -I.  -I/usr/kde/3.5/include  -DQT_THREAD_SUPPORT  -D_REENTRANT  -Wno-long-long -Wundef -ansi -D_XOPEN_SOURCE=500 -D_BSD_SOURCE -Wcast-align -Wconversion -Wchar-subscripts -Wall -W -Wpointer-arith -DNDEBUG -DNO_DEBUG -O2 -march=athlon-xp -pipe -O2 -fno-inline -Wformat-security -Wmissing-format-attribute -Wno-non-virtual-dtor -fno-exceptions -fno-check-new -fno-common -DQT_CLEAN_NAMESPACE -DQT_NO_ASCII_CAST -DQT_NO_STL -DQT_NO_COMPAT -DQT_NO_TRANSLATION  -c -o crashhandler.lo crashhandler.cpp
/usr/kde/3.5/bin/dcopidl2cpp --c++-suffix cpp --no-signals --no-stub amarokdcopiface.kidl
/bin/sh ../../../libtool --silent --tag=CXX --mode=compile i686-pc-linux-gnu-g++ -DHAVE_CONFIG_H -I. -I. -I../../.. -I../../../amarok/src -I../../../amarok/src/amarokcore -I../../../amarok/src -I../../../amarok/src/engine -I../../../amarok/src/plugin -I../../../amarok/src/statusbar -I../../../amarok/src/mediadevice -I/usr/kde/3.5/include -I/usr/qt/3/include -I.  -I/usr/kde/3.5/include  -DQT_THREAD_SUPPORT  -D_REENTRANT  -Wno-long-long -Wundef -ansi -D_XOPEN_SOURCE=500 -D_BSD_SOURCE -Wcast-align -Wconversion -Wchar-subscripts -Wall -W -Wpointer-arith -DNDEBUG -DNO_DEBUG -O2 -march=athlon-xp -pipe -O2 -fno-inline -Wformat-security -Wmissing-format-attribute -Wno-non-virtual-dtor -fno-exceptions -fno-check-new -fno-common -DQT_CLEAN_NAMESPACE -DQT_NO_ASCII_CAST -DQT_NO_STL -DQT_NO_COMPAT -DQT_NO_TRANSLATION  -c -o amarokdcopiface_skel.lo amarokdcopiface_skel.cpp
/bin/sh ../../../libtool --silent --tag=CXX --mode=link i686-pc-linux-gnu-g++  -Wno-long-long -Wundef -ansi -D_XOPEN_SOURCE=500 -D_BSD_SOURCE -Wcast-align -Wconversion -Wchar-subscripts -Wall -W -Wpointer-arith -DNDEBUG -DNO_DEBUG -O2 -march=athlon-xp -pipe -O2 -fno-inline -Wformat-security -Wmissing-format-attribute -Wno-non-virtual-dtor -fno-exceptions -fno-check-new -fno-common -DQT_CLEAN_NAMESPACE -DQT_NO_ASCII_CAST -DQT_NO_STL -DQT_NO_COMPAT -DQT_NO_TRANSLATION    -o libamarokcore.la   amarokdcophandler.lo crashhandler.lo amarokdcopiface_skel.lo amarokconfig.lo
make[4]: Leaving directory `/var/tmp/portage/amarok-1.4.1-r2/work/amarok-1.4.1/amarok/src/amarokcore'
Making all in sqlite
make[4]: Entering directory `/var/tmp/portage/amarok-1.4.1-r2/work/amarok-1.4.1/amarok/src/sqlite'
/bin/sh ../../../libtool --silent --tag=CC --mode=compile i686-pc-linux-gnu-gcc -DHAVE_CONFIG_H -I. -I. -I../../..   -DQT_THREAD_SUPPORT  -D_REENTRANT -I/usr/kde/3.5/include -I/usr/qt/3/include -I.  -I/usr/kde/3.5/include -DTHREADSAFE=1 -DHAVE_USLEEP=1 -fno-strict-aliasing -std=iso9899:1990 -W -Wall -Wchar-subscripts -Wshadow -Wpointer-arith -Wmissing-prototypes -Wwrite-strings -D_XOPEN_SOURCE=500 -D_BSD_SOURCE -DNDEBUG -O2  -march=athlon-xp -pipe -O2 -fno-inline -Wformat-security -Wmissing-format-attribute -c -o libsqlite_la-alter.lo `test -f 'alter.c' || echo './'`alter.c
/bin/sh ../../../libtool --silent --tag=CC --mode=compile i686-pc-linux-gnu-gcc -DHAVE_CONFIG_H -I. -I. -I../../..   -DQT_THREAD_SUPPORT  -D_REENTRANT -I/usr/kde/3.5/include -I/usr/qt/3/include -I.  -I/usr/kde/3.5/include -DTHREADSAFE=1 -DHAVE_USLEEP=1 -fno-strict-aliasing -std=iso9899:1990 -W -Wall -Wchar-subscripts -Wshadow -Wpointer-arith -Wmissing-prototypes -Wwrite-strings -D_XOPEN_SOURCE=500 -D_BSD_SOURCE -DNDEBUG -O2  -march=athlon-xp -pipe -O2 -fno-inline -Wformat-security -Wmissing-format-attribute -c -o libsqlite_la-analyze.lo `test -f 'analyze.c' || echo './'`analyze.c
alter.c: In function 'renameTableFunc':
alter.c:42: warning: unused parameter 'argc'
alter.c: In function 'renameTriggerFunc':
alter.c:90: warning: unused parameter 'argc'
alter.c: In function 'sqlite3AlterFunctions':
alter.c:157: warning: initialization discards qualifiers from pointer target type
alter.c:159: warning: initialization discards qualifiers from pointer target type
alter.c:164: warning: comparison between signed and unsigned
analyze.c: In function 'analysisLoader':
analyze.c:343: warning: unused parameter 'argc'
analyze.c:343: warning: unused parameter 'azNotUsed'
/bin/sh ../../../libtool --silent --tag=CC --mode=compile i686-pc-linux-gnu-gcc -DHAVE_CONFIG_H -I. -I. -I../../..   -DQT_THREAD_SUPPORT  -D_REENTRANT -I/usr/kde/3.5/include -I/usr/qt/3/include -I.  -I/usr/kde/3.5/include -DTHREADSAFE=1 -DHAVE_USLEEP=1 -fno-strict-aliasing -std=iso9899:1990 -W -Wall -Wchar-subscripts -Wshadow -Wpointer-arith -Wmissing-prototypes -Wwrite-strings -D_XOPEN_SOURCE=500 -D_BSD_SOURCE -DNDEBUG -O2  -march=athlon-xp -pipe -O2 -fno-inline -Wformat-security -Wmissing-format-attribute -c -o libsqlite_la-attach.lo `test -f 'attach.c' || echo './'`attach.c
/bin/sh ../../../libtool --silent --tag=CC --mode=compile i686-pc-linux-gnu-gcc -DHAVE_CONFIG_H -I. -I. -I../../..   -DQT_THREAD_SUPPORT  -D_REENTRANT -I/usr/kde/3.5/include -I/usr/qt/3/include -I.  -I/usr/kde/3.5/include -DTHREADSAFE=1 -DHAVE_USLEEP=1 -fno-strict-aliasing -std=iso9899:1990 -W -Wall -Wchar-subscripts -Wshadow -Wpointer-arith -Wmissing-prototypes -Wwrite-strings -D_XOPEN_SOURCE=500 -D_BSD_SOURCE -DNDEBUG -O2  -march=athlon-xp -pipe -O2 -fno-inline -Wformat-security -Wmissing-format-attribute -c -o libsqlite_la-auth.lo `test -f 'auth.c' || echo './'`auth.c
attach.c: In function 'attachFunc':
attach.c:62: warning: unused parameter 'argc'
attach.c: In function 'detachFunc':
attach.c:222: warning: unused parameter 'argc'
/bin/sh ../../../libtool --silent --tag=CC --mode=compile i686-pc-linux-gnu-gcc -DHAVE_CONFIG_H -I. -I. -I../../..   -DQT_THREAD_SUPPORT  -D_REENTRANT -I/usr/kde/3.5/include -I/usr/qt/3/include -I.  -I/usr/kde/3.5/include -DTHREADSAFE=1 -DHAVE_USLEEP=1 -fno-strict-aliasing -std=iso9899:1990 -W -Wall -Wchar-subscripts -Wshadow -Wpointer-arith -Wmissing-prototypes -Wwrite-strings -D_XOPEN_SOURCE=500 -D_BSD_SOURCE -DNDEBUG -O2  -march=athlon-xp -pipe -O2 -fno-inline -Wformat-security -Wmissing-format-attribute -c -o libsqlite_la-btree.lo `test -f 'btree.c' || echo './'`btree.c
/bin/sh ../../../libtool --silent --tag=CC --mode=compile i686-pc-linux-gnu-gcc -DHAVE_CONFIG_H -I. -I. -I../../..   -DQT_THREAD_SUPPORT  -D_REENTRANT -I/usr/kde/3.5/include -I/usr/qt/3/include -I.  -I/usr/kde/3.5/include -DTHREADSAFE=1 -DHAVE_USLEEP=1 -fno-strict-aliasing -std=iso9899:1990 -W -Wall -Wchar-subscripts -Wshadow -Wpointer-arith -Wmissing-prototypes -Wwrite-strings -D_XOPEN_SOURCE=500 -D_BSD_SOURCE -DNDEBUG -O2  -march=athlon-xp -pipe -O2 -fno-inline -Wformat-security -Wmissing-format-attribute -c -o libsqlite_la-build.lo `test -f 'build.c' || echo './'`build.c
btree.c: In function 'autoVacuumCommit':
btree.c:2374: warning: comparison between signed and unsigned
btree.c:2397: warning: comparison between signed and unsigned
btree.c:2402: warning: comparison between signed and unsigned
btree.c:2402: warning: comparison between signed and unsigned
btree.c:2405: warning: comparison between signed and unsigned
btree.c:2418: warning: comparison between signed and unsigned
btree.c: In function 'dfltCompare':
btree.c:2710: warning: unused parameter 'NotUsed'
btree.c: In function 'getPayload':
btree.c:2996: warning: comparison between signed and unsigned
btree.c: In function 'fetchPayload':
btree.c:3136: warning: comparison between signed and unsigned
btree.c: In function 'allocatePage':
btree.c:3817: warning: comparison between signed and unsigned
btree.c: In function 'clearCell':
btree.c:3970: warning: comparison between signed and unsigned
btree.c: In function 'sqlite3BtreeCreateTable':
btree.c:5499: warning: comparison between signed and unsigned
btree.c: In function 'clearDatabasePage':
btree.c:5591: warning: comparison between signed and unsigned
btree.c: In function 'sqlite3BtreeDropTable':
btree.c:5725: warning: comparison between signed and unsigned
btree.c:5768: warning: comparison between signed and unsigned
btree.c: In function 'checkAppendMsg':
btree.c:6078: warning: assignment discards qualifiers from pointer target type
btree.c: In function 'sqlite3BtreeIntegrityCheck':
btree.c:6418: warning: passing argument 5 of 'checkList' discards qualifiers from pointer target type
btree.c:6429: warning: passing argument 4 of 'checkTreePage' discards qualifiers from pointer target type
btree.c:6444: warning: comparison between signed and unsigned
btree.c:6448: warning: comparison between signed and unsigned
build.c: In function 'sqlite3FindDb':
build.c:622: warning: comparison between signed and unsigned
build.c: In function 'createTableStmt':
build.c:1307: warning: assignment discards qualifiers from pointer target type
build.c:1308: warning: assignment discards qualifiers from pointer target type
build.c:1309: warning: assignment discards qualifiers from pointer target type
build.c:1311: warning: assignment discards qualifiers from pointer target type
build.c:1312: warning: assignment discards qualifiers from pointer target type
build.c:1313: warning: assignment discards qualifiers from pointer target type
build.c: In function 'sqlite3EndTable':
build.c:1434: warning: assignment discards qualifiers from pointer target type
build.c:1435: warning: assignment discards qualifiers from pointer target type
build.c:1439: warning: assignment discards qualifiers from pointer target type
build.c:1440: warning: assignment discards qualifiers from pointer target type
/bin/sh ../../../libtool --silent --tag=CC --mode=compile i686-pc-linux-gnu-gcc -DHAVE_CONFIG_H -I. -I. -I../../..   -DQT_THREAD_SUPPORT  -D_REENTRANT -I/usr/kde/3.5/include -I/usr/qt/3/include -I.  -I/usr/kde/3.5/include -DTHREADSAFE=1 -DHAVE_USLEEP=1 -fno-strict-aliasing -std=iso9899:1990 -W -Wall -Wchar-subscripts -Wshadow -Wpointer-arith -Wmissing-prototypes -Wwrite-strings -D_XOPEN_SOURCE=500 -D_BSD_SOURCE -DNDEBUG -O2  -march=athlon-xp -pipe -O2 -fno-inline -Wformat-security -Wmissing-format-attribute -c -o libsqlite_la-callback.lo `test -f 'callback.c' || echo './'`callback.c
btree.c: In function 'sqlite3BtreeDelete':
btree.c:5395: warning: 'szNext' may be used uninitialized in this function
/bin/sh ../../../libtool --silent --tag=CC --mode=compile i686-pc-linux-gnu-gcc -DHAVE_CONFIG_H -I. -I. -I../../..   -DQT_THREAD_SUPPORT  -D_REENTRANT -I/usr/kde/3.5/include -I/usr/qt/3/include -I.  -I/usr/kde/3.5/include -DTHREADSAFE=1 -DHAVE_USLEEP=1 -fno-strict-aliasing -std=iso9899:1990 -W -Wall -Wchar-subscripts -Wshadow -Wpointer-arith -Wmissing-prototypes -Wwrite-strings -D_XOPEN_SOURCE=500 -D_BSD_SOURCE -DNDEBUG -O2  -march=athlon-xp -pipe -O2 -fno-inline -Wformat-security -Wmissing-format-attribute -c -o libsqlite_la-complete.lo `test -f 'complete.c' || echo './'`complete.c
/bin/sh ../../../libtool --silent --tag=CC --mode=compile i686-pc-linux-gnu-gcc -DHAVE_CONFIG_H -I. -I. -I../../..   -DQT_THREAD_SUPPORT  -D_REENTRANT -I/usr/kde/3.5/include -I/usr/qt/3/include -I.  -I/usr/kde/3.5/include -DTHREADSAFE=1 -DHAVE_USLEEP=1 -fno-strict-aliasing -std=iso9899:1990 -W -Wall -Wchar-subscripts -Wshadow -Wpointer-arith -Wmissing-prototypes -Wwrite-strings -D_XOPEN_SOURCE=500 -D_BSD_SOURCE -DNDEBUG -O2  -march=athlon-xp -pipe -O2 -fno-inline -Wformat-security -Wmissing-format-attribute -c -o libsqlite_la-date.lo `test -f 'date.c' || echo './'`date.c
/bin/sh ../../../libtool --silent --tag=CC --mode=compile i686-pc-linux-gnu-gcc -DHAVE_CONFIG_H -I. -I. -I../../..   -DQT_THREAD_SUPPORT  -D_REENTRANT -I/usr/kde/3.5/include -I/usr/qt/3/include -I.  -I/usr/kde/3.5/include -DTHREADSAFE=1 -DHAVE_USLEEP=1 -fno-strict-aliasing -std=iso9899:1990 -W -Wall -Wchar-subscripts -Wshadow -Wpointer-arith -Wmissing-prototypes -Wwrite-strings -D_XOPEN_SOURCE=500 -D_BSD_SOURCE -DNDEBUG -O2  -march=athlon-xp -pipe -O2 -fno-inline -Wformat-security -Wmissing-format-attribute -c -o libsqlite_la-delete.lo `test -f 'delete.c' || echo './'`delete.c
date.c: In function 'parseModifier':
date.c:458: warning: comparison between signed and unsigned
date.c: In function 'strftimeFunc':
date.c:796: warning: comparison between signed and unsigned
date.c: In function 'ctimeFunc':
date.c:868: warning: unused parameter 'argc'
date.c:870: warning: unused parameter 'argv'
date.c: In function 'cdateFunc':
date.c:886: warning: unused parameter 'argc'
date.c:888: warning: unused parameter 'argv'
date.c: In function 'ctimestampFunc':
date.c:904: warning: unused parameter 'argc'
date.c:906: warning: unused parameter 'argv'
date.c: In function 'sqlite3RegisterDateTimeFunctions':
date.c:967: warning: initialization discards qualifiers from pointer target type
date.c:968: warning: initialization discards qualifiers from pointer target type
date.c:969: warning: initialization discards qualifiers from pointer target type
date.c:970: warning: initialization discards qualifiers from pointer target type
date.c:971: warning: initialization discards qualifiers from pointer target type
date.c:972: warning: initialization discards qualifiers from pointer target type
date.c:973: warning: initialization discards qualifiers from pointer target type
date.c:974: warning: initialization discards qualifiers from pointer target type
date.c:978: warning: comparison between signed and unsigned
/bin/sh ../../../libtool --silent --tag=CC --mode=compile i686-pc-linux-gnu-gcc -DHAVE_CONFIG_H -I. -I. -I../../..   -DQT_THREAD_SUPPORT  -D_REENTRANT -I/usr/kde/3.5/include -I/usr/qt/3/include -I.  -I/usr/kde/3.5/include -DTHREADSAFE=1 -DHAVE_USLEEP=1 -fno-strict-aliasing -std=iso9899:1990 -W -Wall -Wchar-subscripts -Wshadow -Wpointer-arith -Wmissing-prototypes -Wwrite-strings -D_XOPEN_SOURCE=500 -D_BSD_SOURCE -DNDEBUG -O2  -march=athlon-xp -pipe -O2 -fno-inline -Wformat-security -Wmissing-format-attribute -c -o libsqlite_la-expr.lo `test -f 'expr.c' || echo './'`expr.c
delete.c: In function 'sqlite3GenerateRowDelete':
delete.c:377: warning: unused parameter 'db'
/bin/sh ../../../libtool --silent --tag=CC --mode=compile i686-pc-linux-gnu-gcc -DHAVE_CONFIG_H -I. -I. -I../../..   -DQT_THREAD_SUPPORT  -D_REENTRANT -I/usr/kde/3.5/include -I/usr/qt/3/include -I.  -I/usr/kde/3.5/include -DTHREADSAFE=1 -DHAVE_USLEEP=1 -fno-strict-aliasing -std=iso9899:1990 -W -Wall -Wchar-subscripts -Wshadow -Wpointer-arith -Wmissing-prototypes -Wwrite-strings -D_XOPEN_SOURCE=500 -D_BSD_SOURCE -DNDEBUG -O2  -march=athlon-xp -pipe -O2 -fno-inline -Wformat-security -Wmissing-format-attribute -c -o libsqlite_la-func.lo `test -f 'func.c' || echo './'`func.c
expr.c: In function 'lookupName':
expr.c:1010: warning: assignment discards qualifiers from pointer target type
expr.c:1031: warning: comparison between signed and unsigned
func.c: In function 'typeofFunc':
func.c:70: warning: unused parameter 'argc'
func.c: In function 'lengthFunc':
func.c:90: warning: unused parameter 'argc'
func.c: In function 'absFunc':
func.c:119: warning: unused parameter 'argc'
func.c: In function 'substrFunc':
func.c:152: warning: unused parameter 'argc'
func.c: In function 'randomFunc':
func.c:265: warning: unused parameter 'argc'
func.c:267: warning: unused parameter 'argv'
func.c: In function 'last_insert_rowid':
func.c:281: warning: unused parameter 'arg'
func.c:283: warning: unused parameter 'argv'
func.c: In function 'changes':
func.c:294: warning: unused parameter 'arg'
func.c:296: warning: unused parameter 'argv'
func.c: In function 'total_changes':
func.c:307: warning: unused parameter 'arg'
func.c:309: warning: unused parameter 'argv'
func.c: In function 'nullifFunc':
func.c:530: warning: unused parameter 'argc'
func.c: In function 'versionFunc':
func.c:545: warning: unused parameter 'argc'
func.c:547: warning: unused parameter 'argv'
func.c: In function 'sumStep':
func.c:846: warning: unused parameter 'argc'
func.c: In function 'minmaxStep':
func.c:925: warning: unused parameter 'argc'
func.c: In function 'sqlite3RegisterBuiltinFunctions':
func.c:980: warning: initialization discards qualifiers from pointer target type
func.c:981: warning: initialization discards qualifiers from pointer target type
func.c:982: warning: initialization discards qualifiers from pointer target type
func.c:983: warning: initialization discards qualifiers from pointer target type
func.c:984: warning: initialization discards qualifiers from pointer target type
func.c:985: warning: initialization discards qualifiers from pointer target type
func.c:986: warning: initialization discards qualifiers from pointer target type
func.c:988: warning: initialization discards qualifiers from pointer target type
func.c:990: warning: initialization discards qualifiers from pointer target type
func.c:991: warning: initialization discards qualifiers from pointer target type
func.c:992: warning: initialization discards qualifiers from pointer target type
func.c:993: warning: initialization discards qualifiers from pointer target type
func.c:994: warning: initialization discards qualifiers from pointer target type
func.c:995: warning: initialization discards qualifiers from pointer target type
func.c:996: warning: initialization discards qualifiers from pointer target type
func.c:997: warning: initialization discards qualifiers from pointer target type
func.c:998: warning: initialization discards qualifiers from pointer target type
func.c:999: warning: initialization discards qualifiers from pointer target type
func.c:1000: warning: initialization discards qualifiers from pointer target type
func.c:1001: warning: initialization discards qualifiers from pointer target type
func.c:1002: warning: initialization discards qualifiers from pointer target type
func.c:1003: warning: initialization discards qualifiers from pointer target type
func.c:1004: warning: initialization discards qualifiers from pointer target type
func.c:1005: warning: initialization discards qualifiers from pointer target type
func.c:1025: warning: initialization discards qualifiers from pointer target type
func.c:1026: warning: initialization discards qualifiers from pointer target type
func.c:1027: warning: initialization discards qualifiers from pointer target type
func.c:1028: warning: initialization discards qualifiers from pointer target type
func.c:1029: warning: initialization discards qualifiers from pointer target type
func.c:1030: warning: initialization discards qualifiers from pointer target type
func.c:1031: warning: initialization discards qualifiers from pointer target type
func.c:1035: warning: comparison between signed and unsigned
func.c:1057: warning: comparison between signed and unsigned
/bin/sh ../../../libtool --silent --tag=CC --mode=compile i686-pc-linux-gnu-gcc -DHAVE_CONFIG_H -I. -I. -I../../..   -DQT_THREAD_SUPPORT  -D_REENTRANT -I/usr/kde/3.5/include -I/usr/qt/3/include -I.  -I/usr/kde/3.5/include -DTHREADSAFE=1 -DHAVE_USLEEP=1 -fno-strict-aliasing -std=iso9899:1990 -W -Wall -Wchar-subscripts -Wshadow -Wpointer-arith -Wmissing-prototypes -Wwrite-strings -D_XOPEN_SOURCE=500 -D_BSD_SOURCE -DNDEBUG -O2  -march=athlon-xp -pipe -O2 -fno-inline -Wformat-security -Wmissing-format-attribute -c -o libsqlite_la-hash.lo `test -f 'hash.c' || echo './'`hash.c
/bin/sh ../../../libtool --silent --tag=CC --mode=compile i686-pc-linux-gnu-gcc -DHAVE_CONFIG_H -I. -I. -I../../..   -DQT_THREAD_SUPPORT  -D_REENTRANT -I/usr/kde/3.5/include -I/usr/qt/3/include -I.  -I/usr/kde/3.5/include -DTHREADSAFE=1 -DHAVE_USLEEP=1 -fno-strict-aliasing -std=iso9899:1990 -W -Wall -Wchar-subscripts -Wshadow -Wpointer-arith -Wmissing-prototypes -Wwrite-strings -D_XOPEN_SOURCE=500 -D_BSD_SOURCE -DNDEBUG -O2  -march=athlon-xp -pipe -O2 -fno-inline -Wformat-security -Wmissing-format-attribute -c -o libsqlite_la-insert.lo `test -f 'insert.c' || echo './'`insert.c
insert.c: In function 'sqlite3GenerateConstraintChecks':
insert.c:994: warning: comparison between signed and unsigned
insert.c:1001: warning: comparison between signed and unsigned
/bin/sh ../../../libtool --silent --tag=CC --mode=compile i686-pc-linux-gnu-gcc -DHAVE_CONFIG_H -I. -I. -I../../..   -DQT_THREAD_SUPPORT  -D_REENTRANT -I/usr/kde/3.5/include -I/usr/qt/3/include -I.  -I/usr/kde/3.5/include -DTHREADSAFE=1 -DHAVE_USLEEP=1 -fno-strict-aliasing -std=iso9899:1990 -W -Wall -Wchar-subscripts -Wshadow -Wpointer-arith -Wmissing-prototypes -Wwrite-strings -D_XOPEN_SOURCE=500 -D_BSD_SOURCE -DNDEBUG -O2  -march=athlon-xp -pipe -O2 -fno-inline -Wformat-security -Wmissing-format-attribute -c -o libsqlite_la-legacy.lo `test -f 'legacy.c' || echo './'`legacy.c
/bin/sh ../../../libtool --silent --tag=CC --mode=compile i686-pc-linux-gnu-gcc -DHAVE_CONFIG_H -I. -I. -I../../..   -DQT_THREAD_SUPPORT  -D_REENTRANT -I/usr/kde/3.5/include -I/usr/qt/3/include -I.  -I/usr/kde/3.5/include -DTHREADSAFE=1 -DHAVE_USLEEP=1 -fno-strict-aliasing -std=iso9899:1990 -W -Wall -Wchar-subscripts -Wshadow -Wpointer-arith -Wmissing-prototypes -Wwrite-strings -D_XOPEN_SOURCE=500 -D_BSD_SOURCE -DNDEBUG -O2  -march=athlon-xp -pipe -O2 -fno-inline -Wformat-security -Wmissing-format-attribute -c -o libsqlite_la-main.lo `test -f 'main.c' || echo './'`main.c
/bin/sh ../../../libtool --silent --tag=CC --mode=compile i686-pc-linux-gnu-gcc -DHAVE_CONFIG_H -I. -I. -I../../..   -DQT_THREAD_SUPPORT  -D_REENTRANT -I/usr/kde/3.5/include -I/usr/qt/3/include -I.  -I/usr/kde/3.5/include -DTHREADSAFE=1 -DHAVE_USLEEP=1 -fno-strict-aliasing -std=iso9899:1990 -W -Wall -Wchar-subscripts -Wshadow -Wpointer-arith -Wmissing-prototypes -Wwrite-strings -D_XOPEN_SOURCE=500 -D_BSD_SOURCE -DNDEBUG -O2  -march=athlon-xp -pipe -O2 -fno-inline -Wformat-security -Wmissing-format-attribute -c -o libsqlite_la-opcodes.lo `test -f 'opcodes.c' || echo './'`opcodes.c
main.c: In function 'binCollFunc':
main.c:41: warning: unused parameter 'NotUsed'
main.c: In function 'nocaseCollatingFunc':
main.c:64: warning: unused parameter 'NotUsed'
main.c: In function 'sqlite3_close':
main.c:131: warning: comparison between signed and unsigned
main.c: In function 'sqliteDefaultBusyCallback':
main.c:266: warning: comparison between signed and unsigned
main.c: In function 'openDatabase':
main.c:859: warning: assignment discards qualifiers from pointer target type
main.c:862: warning: assignment discards qualifiers from pointer target type
/bin/sh ../../../libtool --silent --tag=CC --mode=compile i686-pc-linux-gnu-gcc -DHAVE_CONFIG_H -I. -I. -I../../..   -DQT_THREAD_SUPPORT  -D_REENTRANT -I/usr/kde/3.5/include -I/usr/qt/3/include -I.  -I/usr/kde/3.5/include -DTHREADSAFE=1 -DHAVE_USLEEP=1 -fno-strict-aliasing -std=iso9899:1990 -W -Wall -Wchar-subscripts -Wshadow -Wpointer-arith -Wmissing-prototypes -Wwrite-strings -D_XOPEN_SOURCE=500 -D_BSD_SOURCE -DNDEBUG -O2  -march=athlon-xp -pipe -O2 -fno-inline -Wformat-security -Wmissing-format-attribute -c -o libsqlite_la-os.lo `test -f 'os.c' || echo './'`os.c
/bin/sh ../../../libtool --silent --tag=CC --mode=compile i686-pc-linux-gnu-gcc -DHAVE_CONFIG_H -I. -I. -I../../..   -DQT_THREAD_SUPPORT  -D_REENTRANT -I/usr/kde/3.5/include -I/usr/qt/3/include -I.  -I/usr/kde/3.5/include -DTHREADSAFE=1 -DHAVE_USLEEP=1 -fno-strict-aliasing -std=iso9899:1990 -W -Wall -Wchar-subscripts -Wshadow -Wpointer-arith -Wmissing-prototypes -Wwrite-strings -D_XOPEN_SOURCE=500 -D_BSD_SOURCE -DNDEBUG -O2  -march=athlon-xp -pipe -O2 -fno-inline -Wformat-security -Wmissing-format-attribute -c -o libsqlite_la-os_os2.lo `test -f 'os_os2.c' || echo './'`os_os2.c
/bin/sh ../../../libtool --silent --tag=CC --mode=compile i686-pc-linux-gnu-gcc -DHAVE_CONFIG_H -I. -I. -I../../..   -DQT_THREAD_SUPPORT  -D_REENTRANT -I/usr/kde/3.5/include -I/usr/qt/3/include -I.  -I/usr/kde/3.5/include -DTHREADSAFE=1 -DHAVE_USLEEP=1 -fno-strict-aliasing -std=iso9899:1990 -W -Wall -Wchar-subscripts -Wshadow -Wpointer-arith -Wmissing-prototypes -Wwrite-strings -D_XOPEN_SOURCE=500 -D_BSD_SOURCE -DNDEBUG -O2  -march=athlon-xp -pipe -O2 -fno-inline -Wformat-security -Wmissing-format-attribute -c -o libsqlite_la-os_unix.lo `test -f 'os_unix.c' || echo './'`os_unix.c
/bin/sh ../../../libtool --silent --tag=CC --mode=compile i686-pc-linux-gnu-gcc -DHAVE_CONFIG_H -I. -I. -I../../..   -DQT_THREAD_SUPPORT  -D_REENTRANT -I/usr/kde/3.5/include -I/usr/qt/3/include -I.  -I/usr/kde/3.5/include -DTHREADSAFE=1 -DHAVE_USLEEP=1 -fno-strict-aliasing -std=iso9899:1990 -W -Wall -Wchar-subscripts -Wshadow -Wpointer-arith -Wmissing-prototypes -Wwrite-strings -D_XOPEN_SOURCE=500 -D_BSD_SOURCE -DNDEBUG -O2  -march=athlon-xp -pipe -O2 -fno-inline -Wformat-security -Wmissing-format-attribute -c -o libsqlite_la-os_win.lo `test -f 'os_win.c' || echo './'`os_win.c
/bin/sh ../../../libtool --silent --tag=CC --mode=compile i686-pc-linux-gnu-gcc -DHAVE_CONFIG_H -I. -I. -I../../..   -DQT_THREAD_SUPPORT  -D_REENTRANT -I/usr/kde/3.5/include -I/usr/qt/3/include -I.  -I/usr/kde/3.5/include -DTHREADSAFE=1 -DHAVE_USLEEP=1 -fno-strict-aliasing -std=iso9899:1990 -W -Wall -Wchar-subscripts -Wshadow -Wpointer-arith -Wmissing-prototypes -Wwrite-strings -D_XOPEN_SOURCE=500 -D_BSD_SOURCE -DNDEBUG -O2  -march=athlon-xp -pipe -O2 -fno-inline -Wformat-security -Wmissing-format-attribute -c -o libsqlite_la-pager.lo `test -f 'pager.c' || echo './'`pager.c
In file included from os_unix.c:109:
os_common.h: In function 'sqlite3GenericAllocationSize':
os_common.h:187: warning: unused parameter 'p'
os_unix.c: In function 'sqlite3UnixTempFileName':
os_unix.c:869: warning: comparison between signed and unsigned
os_unix.c: In function 'full_fsync':
os_unix.c:1043: warning: unused parameter 'fullSync'
os_unix.c: In function 'sqlite3UnixThreadSpecificData':
os_unix.c:1891: warning: missing initializer
os_unix.c:1891: warning: (near initialization for 'zeroData.useSharedData')
/bin/sh ../../../libtool --silent --tag=CC --mode=compile i686-pc-linux-gnu-gcc -DHAVE_CONFIG_H -I. -I. -I../../..   -DQT_THREAD_SUPPORT  -D_REENTRANT -I/usr/kde/3.5/include -I/usr/qt/3/include -I.  -I/usr/kde/3.5/include -DTHREADSAFE=1 -DHAVE_USLEEP=1 -fno-strict-aliasing -std=iso9899:1990 -W -Wall -Wchar-subscripts -Wshadow -Wpointer-arith -Wmissing-prototypes -Wwrite-strings -D_XOPEN_SOURCE=500 -D_BSD_SOURCE -DNDEBUG -O2  -march=athlon-xp -pipe -O2 -fno-inline -Wformat-security -Wmissing-format-attribute -c -o libsqlite_la-parse.lo `test -f 'parse.c' || echo './'`parse.c
pager.c: In function 'readMasterJournal':
pager.c:566: warning: comparison between signed and unsigned
pager.c: In function 'pager_playback_one_page':
pager.c:992: warning: comparison between signed and unsigned
pager.c: In function 'pager_playback':
pager.c:1330: warning: comparison between signed and unsigned
pager.c: In function 'memoryTruncate':
pager.c:1926: warning: comparison between signed and unsigned
pager.c: In function 'pager_write_pagelist':
pager.c:2305: warning: comparison between signed and unsigned
pager.c: In function 'sqlite3pager_get':
pager.c:2551: warning: comparison between signed and unsigned
pager.c: In function 'sqlite3pager_sync':
pager.c:3688: warning: comparison between signed and unsigned
pager.c:3689: warning: comparison between signed and unsigned
parse.c:1159: warning: no previous prototype for 'sqlite3ParserTokenName'
parse.c: In function 'sqlite3ParserTokenName':
parse.c:1159: warning: unused parameter 'tokenType'
parse.c: At top level:
parse.c:1183: warning: no previous prototype for 'sqlite3ParserAlloc'
parse.c:1330: warning: no previous prototype for 'sqlite3ParserFree'
parse.c: In function 'yy_find_shift_action':
parse.c:1359: warning: comparison between signed and unsigned
parse.c:1363: warning: comparison between signed and unsigned
parse.c: In function 'yy_find_reduce_action':
parse.c:1402: warning: comparison between signed and unsigned
parse.c: In function 'yy_syntax_error':
parse.c:3135: warning: unused parameter 'yymajor'
parse.c: At top level:
parse.c:3197: warning: no previous prototype for 'sqlite3Parser'
/bin/sh ../../../libtool --silent --tag=CC --mode=compile i686-pc-linux-gnu-gcc -DHAVE_CONFIG_H -I. -I. -I../../..   -DQT_THREAD_SUPPORT  -D_REENTRANT -I/usr/kde/3.5/include -I/usr/qt/3/include -I.  -I/usr/kde/3.5/include -DTHREADSAFE=1 -DHAVE_USLEEP=1 -fno-strict-aliasing -std=iso9899:1990 -W -Wall -Wchar-subscripts -Wshadow -Wpointer-arith -Wmissing-prototypes -Wwrite-strings -D_XOPEN_SOURCE=500 -D_BSD_SOURCE -DNDEBUG -O2  -march=athlon-xp -pipe -O2 -fno-inline -Wformat-security -Wmissing-format-attribute -c -o libsqlite_la-pragma.lo `test -f 'pragma.c' || echo './'`pragma.c
/bin/sh ../../../libtool --silent --tag=CC --mode=compile i686-pc-linux-gnu-gcc -DHAVE_CONFIG_H -I. -I. -I../../..   -DQT_THREAD_SUPPORT  -D_REENTRANT -I/usr/kde/3.5/include -I/usr/qt/3/include -I.  -I/usr/kde/3.5/include -DTHREADSAFE=1 -DHAVE_USLEEP=1 -fno-strict-aliasing -std=iso9899:1990 -W -Wall -Wchar-subscripts -Wshadow -Wpointer-arith -Wmissing-prototypes -Wwrite-strings -D_XOPEN_SOURCE=500 -D_BSD_SOURCE -DNDEBUG -O2  -march=athlon-xp -pipe -O2 -fno-inline -Wformat-security -Wmissing-format-attribute -c -o libsqlite_la-prepare.lo `test -f 'prepare.c' || echo './'`prepare.c
pragma.c: In function 'getSafetyLevel':
pragma.c:50: warning: comparison between signed and unsigned
pragma.c: In function 'flagPragma':
pragma.c:169: warning: comparison between signed and unsigned
pragma.c: In function 'sqlite3Pragma':
pragma.c:650: warning: initialization discards qualifiers from pointer target type
pragma.c:713: warning: initialization discards qualifiers from pointer target type
pragma.c:715: warning: initialization discards qualifiers from pointer target type
pragma.c:738: warning: initialization discards qualifiers from pointer target type
pragma.c:787: warning: initialization discards qualifiers from pointer target type
pragma.c:788: warning: initialization discards qualifiers from pointer target type
pragma.c:789: warning: initialization discards qualifiers from pointer target type
pragma.c:790: warning: initialization discards qualifiers from pointer target type
pragma.c:791: warning: initialization discards qualifiers from pointer target type
pragma.c:792: warning: initialization discards qualifiers from pointer target type
pragma.c:793: warning: initialization discards qualifiers from pointer target type
pragma.c:794: warning: initialization discards qualifiers from pointer target type
prepare.c: In function 'sqlite3InitCallback':
prepare.c:47: warning: unused parameter 'argc'
prepare.c:47: warning: unused parameter 'azColName'
prepare.c: In function 'sqlite3InitOne':
prepare.c:226: warning: comparison between signed and unsigned
/bin/sh ../../../libtool --silent --tag=CC --mode=compile i686-pc-linux-gnu-gcc -DHAVE_CONFIG_H -I. -I. -I../../..   -DQT_THREAD_SUPPORT  -D_REENTRANT -I/usr/kde/3.5/include -I/usr/qt/3/include -I.  -I/usr/kde/3.5/include -DTHREADSAFE=1 -DHAVE_USLEEP=1 -fno-strict-aliasing -std=iso9899:1990 -W -Wall -Wchar-subscripts -Wshadow -Wpointer-arith -Wmissing-prototypes -Wwrite-strings -D_XOPEN_SOURCE=500 -D_BSD_SOURCE -DNDEBUG -O2  -march=athlon-xp -pipe -O2 -fno-inline -Wformat-security -Wmissing-format-attribute -c -o libsqlite_la-printf.lo `test -f 'printf.c' || echo './'`printf.c
/bin/sh ../../../libtool --silent --tag=CC --mode=compile i686-pc-linux-gnu-gcc -DHAVE_CONFIG_H -I. -I. -I../../..   -DQT_THREAD_SUPPORT  -D_REENTRANT -I/usr/kde/3.5/include -I/usr/qt/3/include -I.  -I/usr/kde/3.5/include -DTHREADSAFE=1 -DHAVE_USLEEP=1 -fno-strict-aliasing -std=iso9899:1990 -W -Wall -Wchar-subscripts -Wshadow -Wpointer-arith -Wmissing-prototypes -Wwrite-strings -D_XOPEN_SOURCE=500 -D_BSD_SOURCE -DNDEBUG -O2  -march=athlon-xp -pipe -O2 -fno-inline -Wformat-security -Wmissing-format-attribute -c -o libsqlite_la-random.lo `test -f 'random.c' || echo './'`random.c
printf.c: In function 'vxprintf':
printf.c:331: warning: comparison between signed and unsigned
printf.c:463: warning: assignment discards qualifiers from pointer target type
printf.c:594: warning: assignment discards qualifiers from pointer target type
printf.c:607: warning: assignment discards qualifiers from pointer target type
printf.c:664: warning: comparison between signed and unsigned
printf.c:680: warning: comparison between signed and unsigned
/bin/sh ../../../libtool --silent --tag=CC --mode=compile i686-pc-linux-gnu-gcc -DHAVE_CONFIG_H -I. -I. -I../../..   -DQT_THREAD_SUPPORT  -D_REENTRANT -I/usr/kde/3.5/include -I/usr/qt/3/include -I.  -I/usr/kde/3.5/include -DTHREADSAFE=1 -DHAVE_USLEEP=1 -fno-strict-aliasing -std=iso9899:1990 -W -Wall -Wchar-subscripts -Wshadow -Wpointer-arith -Wmissing-prototypes -Wwrite-strings -D_XOPEN_SOURCE=500 -D_BSD_SOURCE -DNDEBUG -O2  -march=athlon-xp -pipe -O2 -fno-inline -Wformat-security -Wmissing-format-attribute -c -o libsqlite_la-select.lo `test -f 'select.c' || echo './'`select.c
/bin/sh ../../../libtool --silent --tag=CC --mode=compile i686-pc-linux-gnu-gcc -DHAVE_CONFIG_H -I. -I. -I../../..   -DQT_THREAD_SUPPORT  -D_REENTRANT -I/usr/kde/3.5/include -I/usr/qt/3/include -I.  -I/usr/kde/3.5/include -DTHREADSAFE=1 -DHAVE_USLEEP=1 -fno-strict-aliasing -std=iso9899:1990 -W -Wall -Wchar-subscripts -Wshadow -Wpointer-arith -Wmissing-prototypes -Wwrite-strings -D_XOPEN_SOURCE=500 -D_BSD_SOURCE -DNDEBUG -O2  -march=athlon-xp -pipe -O2 -fno-inline -Wformat-security -Wmissing-format-attribute -c -o libsqlite_la-table.lo `test -f 'table.c' || echo './'`table.c
select.c: In function 'sqlite3JoinType':
select.c:135: warning: comparison between signed and unsigned
select.c:142: warning: comparison between signed and unsigned
select.c: In function 'generateColumnNames':
select.c:990: warning: assignment discards qualifiers from pointer target type
select.c: In function 'selectOpName':
select.c:1027: warning: assignment discards qualifiers from pointer target type
select.c:1028: warning: assignment discards qualifiers from pointer target type
select.c:1029: warning: assignment discards qualifiers from pointer target type
select.c:1030: warning: assignment discards qualifiers from pointer target type
select.c: In function 'generateSortTail':
select.c:691: warning: 'pseudoTab' may be used uninitialized in this function
/bin/sh ../../../libtool --silent --tag=CC --mode=compile i686-pc-linux-gnu-gcc -DHAVE_CONFIG_H -I. -I. -I../../..   -DQT_THREAD_SUPPORT  -D_REENTRANT -I/usr/kde/3.5/include -I/usr/qt/3/include -I.  -I/usr/kde/3.5/include -DTHREADSAFE=1 -DHAVE_USLEEP=1 -fno-strict-aliasing -std=iso9899:1990 -W -Wall -Wchar-subscripts -Wshadow -Wpointer-arith -Wmissing-prototypes -Wwrite-strings -D_XOPEN_SOURCE=500 -D_BSD_SOURCE -DNDEBUG -O2  -march=athlon-xp -pipe -O2 -fno-inline -Wformat-security -Wmissing-format-attribute -c -o libsqlite_la-tokenize.lo `test -f 'tokenize.c' || echo './'`tokenize.c
/bin/sh ../../../libtool --silent --tag=CC --mode=compile i686-pc-linux-gnu-gcc -DHAVE_CONFIG_H -I. -I. -I../../..   -DQT_THREAD_SUPPORT  -D_REENTRANT -I/usr/kde/3.5/include -I/usr/qt/3/include -I.  -I/usr/kde/3.5/include -DTHREADSAFE=1 -DHAVE_USLEEP=1 -fno-strict-aliasing -std=iso9899:1990 -W -Wall -Wchar-subscripts -Wshadow -Wpointer-arith -Wmissing-prototypes -Wwrite-strings -D_XOPEN_SOURCE=500 -D_BSD_SOURCE -DNDEBUG -O2  -march=athlon-xp -pipe -O2 -fno-inline -Wformat-security -Wmissing-format-attribute -c -o libsqlite_la-trigger.lo `test -f 'trigger.c' || echo './'`trigger.c
/bin/sh ../../../libtool --silent --tag=CC --mode=compile i686-pc-linux-gnu-gcc -DHAVE_CONFIG_H -I. -I. -I../../..   -DQT_THREAD_SUPPORT  -D_REENTRANT -I/usr/kde/3.5/include -I/usr/qt/3/include -I.  -I/usr/kde/3.5/include -DTHREADSAFE=1 -DHAVE_USLEEP=1 -fno-strict-aliasing -std=iso9899:1990 -W -Wall -Wchar-subscripts -Wshadow -Wpointer-arith -Wmissing-prototypes -Wwrite-strings -D_XOPEN_SOURCE=500 -D_BSD_SOURCE -DNDEBUG -O2  -march=athlon-xp -pipe -O2 -fno-inline -Wformat-security -Wmissing-format-attribute -c -o libsqlite_la-update.lo `test -f 'update.c' || echo './'`update.c
trigger.c: In function 'sqlite3FinishTrigger':
trigger.c:227: warning: initialization discards qualifiers from pointer target type
trigger.c:231: warning: initialization discards qualifiers from pointer target type
trigger.c:234: warning: initialization discards qualifiers from pointer target type
trigger.c: In function 'sqlite3DropTriggerPtr':
trigger.c:518: warning: initialization discards qualifiers from pointer target type
trigger.c: In function 'sqlite3TriggersExist':
trigger.c:592: warning: unused parameter 'pParse'
/bin/sh ../../../libtool --silent --tag=CC --mode=compile i686-pc-linux-gnu-gcc -DHAVE_CONFIG_H -I. -I. -I../../..   -DQT_THREAD_SUPPORT  -D_REENTRANT -I/usr/kde/3.5/include -I/usr/qt/3/include -I.  -I/usr/kde/3.5/include -DTHREADSAFE=1 -DHAVE_USLEEP=1 -fno-strict-aliasing -std=iso9899:1990 -W -Wall -Wchar-subscripts -Wshadow -Wpointer-arith -Wmissing-prototypes -Wwrite-strings -D_XOPEN_SOURCE=500 -D_BSD_SOURCE -DNDEBUG -O2  -march=athlon-xp -pipe -O2 -fno-inline -Wformat-security -Wmissing-format-attribute -c -o libsqlite_la-utf.lo `test -f 'utf.c' || echo './'`utf.c
/bin/sh ../../../libtool --silent --tag=CC --mode=compile i686-pc-linux-gnu-gcc -DHAVE_CONFIG_H -I. -I. -I../../..   -DQT_THREAD_SUPPORT  -D_REENTRANT -I/usr/kde/3.5/include -I/usr/qt/3/include -I.  -I/usr/kde/3.5/include -DTHREADSAFE=1 -DHAVE_USLEEP=1 -fno-strict-aliasing -std=iso9899:1990 -W -Wall -Wchar-subscripts -Wshadow -Wpointer-arith -Wmissing-prototypes -Wwrite-strings -D_XOPEN_SOURCE=500 -D_BSD_SOURCE -DNDEBUG -O2  -march=athlon-xp -pipe -O2 -fno-inline -Wformat-security -Wmissing-format-attribute -c -o libsqlite_la-util.lo `test -f 'util.c' || echo './'`util.c
utf.c: In function 'sqlite3utf16Substr':
utf.c:509: warning: unused parameter 'argc'
util.c: In function 'sqlite3SafetyOn':
util.c:1149: warning: comparison between signed and unsigned
util.c:1152: warning: comparison between signed and unsigned
util.c: In function 'sqlite3SafetyOff':
util.c:1165: warning: comparison between signed and unsigned
util.c:1168: warning: comparison between signed and unsigned
util.c: In function 'sqlite3SafetyCheck':
util.c:1188: warning: comparison between signed and unsigned
util.c:1189: warning: comparison between signed and unsigned
util.c:1190: warning: comparison between signed and unsigned
util.c: In function 'sqlite3ThreadDataReadOnly':
util.c:1412: warning: missing initializer
util.c:1412: warning: (near initialization for 'zeroData.useSharedData')
/bin/sh ../../../libtool --silent --tag=CC --mode=compile i686-pc-linux-gnu-gcc -DHAVE_CONFIG_H -I. -I. -I../../..   -DQT_THREAD_SUPPORT  -D_REENTRANT -I/usr/kde/3.5/include -I/usr/qt/3/include -I.  -I/usr/kde/3.5/include -DTHREADSAFE=1 -DHAVE_USLEEP=1 -fno-strict-aliasing -std=iso9899:1990 -W -Wall -Wchar-subscripts -Wshadow -Wpointer-arith -Wmissing-prototypes -Wwrite-strings -D_XOPEN_SOURCE=500 -D_BSD_SOURCE -DNDEBUG -O2  -march=athlon-xp -pipe -O2 -fno-inline -Wformat-security -Wmissing-format-attribute -c -o libsqlite_la-vacuum.lo `test -f 'vacuum.c' || echo './'`vacuum.c
/bin/sh ../../../libtool --silent --tag=CC --mode=compile i686-pc-linux-gnu-gcc -DHAVE_CONFIG_H -I. -I. -I../../..   -DQT_THREAD_SUPPORT  -D_REENTRANT -I/usr/kde/3.5/include -I/usr/qt/3/include -I.  -I/usr/kde/3.5/include -DTHREADSAFE=1 -DHAVE_USLEEP=1 -fno-strict-aliasing -std=iso9899:1990 -W -Wall -Wchar-subscripts -Wshadow -Wpointer-arith -Wmissing-prototypes -Wwrite-strings -D_XOPEN_SOURCE=500 -D_BSD_SOURCE -DNDEBUG -O2  -march=athlon-xp -pipe -O2 -fno-inline -Wformat-security -Wmissing-format-attribute -c -o libsqlite_la-vdbe.lo `test -f 'vdbe.c' || echo './'`vdbe.c
vacuum.c: In function 'sqlite3RunVacuum':
vacuum.c:277: warning: comparison between signed and unsigned
/bin/sh ../../../libtool --silent --tag=CC --mode=compile i686-pc-linux-gnu-gcc -DHAVE_CONFIG_H -I. -I. -I../../..   -DQT_THREAD_SUPPORT  -D_REENTRANT -I/usr/kde/3.5/include -I/usr/qt/3/include -I.  -I/usr/kde/3.5/include -DTHREADSAFE=1 -DHAVE_USLEEP=1 -fno-strict-aliasing -std=iso9899:1990 -W -Wall -Wchar-subscripts -Wshadow -Wpointer-arith -Wmissing-prototypes -Wwrite-strings -D_XOPEN_SOURCE=500 -D_BSD_SOURCE -DNDEBUG -O2  -march=athlon-xp -pipe -O2 -fno-inline -Wformat-security -Wmissing-format-attribute -c -o libsqlite_la-vdbeapi.lo `test -f 'vdbeapi.c' || echo './'`vdbeapi.c
vdbe.c: In function 'sqlite3VdbeExec':
vdbe.c:433: warning: comparison between signed and unsigned
vdbe.c:769: warning: assignment discards qualifiers from pointer target type
vdbe.c:2000: warning: comparison between signed and unsigned
vdbe.c:2016: warning: comparison between signed and unsigned
vdbe.c:2031: warning: comparison between signed and unsigned
vdbe.c:2229: warning: comparison between signed and unsigned
vdbe.c:2262: warning: comparison between signed and unsigned
vdbe.c:3212: warning: comparison between signed and unsigned
vdbe.c:4129: warning: assignment discards qualifiers from pointer target type
vdbe.c:4642: warning: comparison between signed and unsigned
vdbeapi.c: In function 'sqlite3_step':
vdbeapi.c:165: warning: comparison between signed and unsigned
vdbeapi.c: In function 'vdbeUnbind':
vdbeapi.c:614: warning: comparison between signed and unsigned
vdbeapi.c: In function 'sqlite3_transfer_bindings':
vdbeapi.c:792: warning: comparison between signed and unsigned
vdbeapi.c:793: warning: comparison between signed and unsigned
/bin/sh ../../../libtool --silent --tag=CC --mode=compile i686-pc-linux-gnu-gcc -DHAVE_CONFIG_H -I. -I. -I../../..   -DQT_THREAD_SUPPORT  -D_REENTRANT -I/usr/kde/3.5/include -I/usr/qt/3/include -I.  -I/usr/kde/3.5/include -DTHREADSAFE=1 -DHAVE_USLEEP=1 -fno-strict-aliasing -std=iso9899:1990 -W -Wall -Wchar-subscripts -Wshadow -Wpointer-arith -Wmissing-prototypes -Wwrite-strings -D_XOPEN_SOURCE=500 -D_BSD_SOURCE -DNDEBUG -O2  -march=athlon-xp -pipe -O2 -fno-inline -Wformat-security -Wmissing-format-attribute -c -o libsqlite_la-vdbeaux.lo `test -f 'vdbeaux.c' || echo './'`vdbeaux.c
/bin/sh ../../../libtool --silent --tag=CC --mode=compile i686-pc-linux-gnu-gcc -DHAVE_CONFIG_H -I. -I. -I../../..   -DQT_THREAD_SUPPORT  -D_REENTRANT -I/usr/kde/3.5/include -I/usr/qt/3/include -I.  -I/usr/kde/3.5/include -DTHREADSAFE=1 -DHAVE_USLEEP=1 -fno-strict-aliasing -std=iso9899:1990 -W -Wall -Wchar-subscripts -Wshadow -Wpointer-arith -Wmissing-prototypes -Wwrite-strings -D_XOPEN_SOURCE=500 -D_BSD_SOURCE -DNDEBUG -O2  -march=athlon-xp -pipe -O2 -fno-inline -Wformat-security -Wmissing-format-attribute -c -o libsqlite_la-vdbefifo.lo `test -f 'vdbefifo.c' || echo './'`vdbefifo.c
vdbeaux.c: In function 'resizeOpArray':
vdbeaux.c:71: warning: comparison between signed and unsigned
vdbeaux.c: In function 'displayP3':
vdbeaux.c:564: warning: comparison between signed and unsigned
vdbeaux.c:573: warning: assignment discards qualifiers from pointer target type
vdbeaux.c: In function 'sqlite3VdbeList':
vdbeaux.c:625: warning: comparison between signed and unsigned
vdbeaux.c: At top level:
vdbeaux.c:693: warning: no previous prototype for 'sqlite3VdbePrintSql'
vdbeaux.c: In function 'sqlite3VdbePrintSql':
vdbeaux.c:693: warning: unused parameter 'p'
vdbeaux.c: In function 'vdbeCommit':
vdbeaux.c:1003: warning: declaration of 'random' shadows a global declaration
/usr/include/stdlib.h:445: warning: shadowed declaration is here
vdbeaux.c: In function 'sqlite3AbortOtherActiveVdbes':
vdbeaux.c:1131: warning: comparison between signed and unsigned
vdbeaux.c: In function 'sqlite3VdbeHalt':
vdbeaux.c:1212: warning: comparison between signed and unsigned
vdbeaux.c: In function 'sqlite3VdbeReset':
vdbeaux.c:1368: warning: comparison between signed and unsigned
vdbeaux.c: In function 'sqlite3VdbeFinalize':
vdbeaux.c:1447: warning: comparison between signed and unsigned
vdbeaux.c: In function 'sqlite3VdbeRecordCompare':
vdbeaux.c:1813: warning: comparison between signed and unsigned
vdbeaux.c:1815: warning: comparison between signed and unsigned
vdbeaux.c:1841: warning: comparison between signed and unsigned
vdbeaux.c:1843: warning: comparison between signed and unsigned
/bin/sh ../../../libtool --silent --tag=CC --mode=compile i686-pc-linux-gnu-gcc -DHAVE_CONFIG_H -I. -I. -I../../..   -DQT_THREAD_SUPPORT  -D_REENTRANT -I/usr/kde/3.5/include -I/usr/qt/3/include -I.  -I/usr/kde/3.5/include -DTHREADSAFE=1 -DHAVE_USLEEP=1 -fno-strict-aliasing -std=iso9899:1990 -W -Wall -Wchar-subscripts -Wshadow -Wpointer-arith -Wmissing-prototypes -Wwrite-strings -D_XOPEN_SOURCE=500 -D_BSD_SOURCE -DNDEBUG -O2  -march=athlon-xp -pipe -O2 -fno-inline -Wformat-security -Wmissing-format-attribute -c -o libsqlite_la-vdbemem.lo `test -f 'vdbemem.c' || echo './'`vdbemem.c
/bin/sh ../../../libtool --silent --tag=CC --mode=compile i686-pc-linux-gnu-gcc -DHAVE_CONFIG_H -I. -I. -I../../..   -DQT_THREAD_SUPPORT  -D_REENTRANT -I/usr/kde/3.5/include -I/usr/qt/3/include -I.  -I/usr/kde/3.5/include -DTHREADSAFE=1 -DHAVE_USLEEP=1 -fno-strict-aliasing -std=iso9899:1990 -W -Wall -Wchar-subscripts -Wshadow -Wpointer-arith -Wmissing-prototypes -Wwrite-strings -D_XOPEN_SOURCE=500 -D_BSD_SOURCE -DNDEBUG -O2  -march=athlon-xp -pipe -O2 -fno-inline -Wformat-security -Wmissing-format-attribute -c -o libsqlite_la-where.lo `test -f 'where.c' || echo './'`where.c
vdbemem.c: In function 'sqlite3VdbeMemMakeWriteable':
vdbemem.c:106: warning: comparison between signed and unsigned
where.c: In function 'bestIndex':
where.c:1097: warning: comparison between signed and unsigned
where.c: In function 'codeEqualityTerm':
where.c:1212: warning: unused parameter 'brk'
where.c: In function 'sqlite3WhereBegin':
where.c:1441: warning: comparison between signed and unsigned
where.c:1607: warning: comparison between signed and unsigned
/bin/sh ../../../libtool --silent --tag=CC --mode=link i686-pc-linux-gnu-gcc  -std=iso9899:1990 -W -Wall -Wchar-subscripts -Wshadow -Wpointer-arith -Wmissing-prototypes -Wwrite-strings -D_XOPEN_SOURCE=500 -D_BSD_SOURCE -DNDEBUG -O2  -march=athlon-xp -pipe -O2 -fno-inline -Wformat-security -Wmissing-format-attribute   -o libsqlite.la  -lpthread libsqlite_la-alter.lo libsqlite_la-analyze.lo libsqlite_la-attach.lo libsqlite_la-auth.lo libsqlite_la-btree.lo libsqlite_la-build.lo libsqlite_la-callback.lo libsqlite_la-complete.lo libsqlite_la-date.lo libsqlite_la-delete.lo libsqlite_la-expr.lo libsqlite_la-func.lo libsqlite_la-hash.lo libsqlite_la-insert.lo libsqlite_la-legacy.lo libsqlite_la-main.lo libsqlite_la-opcodes.lo libsqlite_la-os.lo libsqlite_la-os_os2.lo libsqlite_la-os_unix.lo libsqlite_la-os_win.lo libsqlite_la-pager.lo libsqlite_la-parse.lo libsqlite_la-pragma.lo libsqlite_la-prepare.lo libsqlite_la-printf.lo libsqlite_la-random.lo libsqlite_la-select.lo libsqlite_la-table.lo libsqlite_la-tokenize.lo libsqlite_la-trigger.lo libsqlite_la-update.lo libsqlite_la-utf.lo libsqlite_la-util.lo libsqlite_la-vacuum.lo libsqlite_la-vdbe.lo libsqlite_la-vdbeapi.lo libsqlite_la-vdbeaux.lo libsqlite_la-vdbefifo.lo libsqlite_la-vdbemem.lo libsqlite_la-where.lo
make[4]: Leaving directory `/var/tmp/portage/amarok-1.4.1-r2/work/amarok-1.4.1/amarok/src/sqlite'
Making all in analyzers
make[4]: Entering directory `/var/tmp/portage/amarok-1.4.1-r2/work/amarok-1.4.1/amarok/src/analyzers'
/usr/qt/3/bin/moc ./analyzerbase.h -o analyzerbase.moc
/bin/sh ../../../libtool --silent --tag=CXX --mode=compile i686-pc-linux-gnu-g++ -DHAVE_CONFIG_H -I. -I. -I../../.. -I../../../amarok/src/amarokcore -I../../../amarok/src -I../../../amarok/src/amarokcore -I../../../amarok/src/engine -I../../../amarok/src/plugin -I../../../amarok/src -I/usr/kde/3.5/include -I/usr/qt/3/include -I.  -I/usr/kde/3.5/include  -DQT_THREAD_SUPPORT  -D_REENTRANT  -Wno-long-long -Wundef -ansi -D_XOPEN_SOURCE=500 -D_BSD_SOURCE -Wcast-align -Wconversion -Wchar-subscripts -Wall -W -Wpointer-arith -DNDEBUG -DNO_DEBUG -O2 -march=athlon-xp -pipe -O2 -fno-inline -Wformat-security -Wmissing-format-attribute -Wno-non-virtual-dtor -fno-exceptions -fno-check-new -fno-common -DQT_CLEAN_NAMESPACE -DQT_NO_ASCII_CAST -DQT_NO_STL -DQT_NO_COMPAT -DQT_NO_TRANSLATION  -c -o analyzerfactory.lo analyzerfactory.cpp
/bin/sh ../../../libtool --silent --tag=CXX --mode=compile i686-pc-linux-gnu-g++ -DHAVE_CONFIG_H -I. -I. -I../../.. -I../../../amarok/src/amarokcore -I../../../amarok/src -I../../../amarok/src/amarokcore -I../../../amarok/src/engine -I../../../amarok/src/plugin -I../../../amarok/src -I/usr/kde/3.5/include -I/usr/qt/3/include -I.  -I/usr/kde/3.5/include  -DQT_THREAD_SUPPORT  -D_REENTRANT  -Wno-long-long -Wundef -ansi -D_XOPEN_SOURCE=500 -D_BSD_SOURCE -Wcast-align -Wconversion -Wchar-subscripts -Wall -W -Wpointer-arith -DNDEBUG -DNO_DEBUG -O2 -march=athlon-xp -pipe -O2 -fno-inline -Wformat-security -Wmissing-format-attribute -Wno-non-virtual-dtor -fno-exceptions -fno-check-new -fno-common -DQT_CLEAN_NAMESPACE -DQT_NO_ASCII_CAST -DQT_NO_STL -DQT_NO_COMPAT -DQT_NO_TRANSLATION  -c -o baranalyzer.lo baranalyzer.cpp
/bin/sh ../../../libtool --silent --tag=CXX --mode=compile i686-pc-linux-gnu-g++ -DHAVE_CONFIG_H -I. -I. -I../../.. -I../../../amarok/src/amarokcore -I../../../amarok/src -I../../../amarok/src/amarokcore -I../../../amarok/src/engine -I../../../amarok/src/plugin -I../../../amarok/src -I/usr/kde/3.5/include -I/usr/qt/3/include -I.  -I/usr/kde/3.5/include  -DQT_THREAD_SUPPORT  -D_REENTRANT  -Wno-long-long -Wundef -ansi -D_XOPEN_SOURCE=500 -D_BSD_SOURCE -Wcast-align -Wconversion -Wchar-subscripts -Wall -W -Wpointer-arith -DNDEBUG -DNO_DEBUG -O2 -march=athlon-xp -pipe -O2 -fno-inline -Wformat-security -Wmissing-format-attribute -Wno-non-virtual-dtor -fno-exceptions -fno-check-new -fno-common -DQT_CLEAN_NAMESPACE -DQT_NO_ASCII_CAST -DQT_NO_STL -DQT_NO_COMPAT -DQT_NO_TRANSLATION  -c -o blockanalyzer.lo blockanalyzer.cpp
/bin/sh ../../../libtool --silent --tag=CXX --mode=compile i686-pc-linux-gnu-g++ -DHAVE_CONFIG_H -I. -I. -I../../.. -I../../../amarok/src/amarokcore -I../../../amarok/src -I../../../amarok/src/amarokcore -I../../../amarok/src/engine -I../../../amarok/src/plugin -I../../../amarok/src -I/usr/kde/3.5/include -I/usr/qt/3/include -I.  -I/usr/kde/3.5/include  -DQT_THREAD_SUPPORT  -D_REENTRANT  -Wno-long-long -Wundef -ansi -D_XOPEN_SOURCE=500 -D_BSD_SOURCE -Wcast-align -Wconversion -Wchar-subscripts -Wall -W -Wpointer-arith -DNDEBUG -DNO_DEBUG -O2 -march=athlon-xp -pipe -O2 -fno-inline -Wformat-security -Wmissing-format-attribute -Wno-non-virtual-dtor -fno-exceptions -fno-check-new -fno-common -DQT_CLEAN_NAMESPACE -DQT_NO_ASCII_CAST -DQT_NO_STL -DQT_NO_COMPAT -DQT_NO_TRANSLATION  -c -o glanalyzer.lo glanalyzer.cpp
/bin/sh ../../../libtool --silent --tag=CXX --mode=compile i686-pc-linux-gnu-g++ -DHAVE_CONFIG_H -I. -I. -I../../.. -I../../../amarok/src/amarokcore -I../../../amarok/src -I../../../amarok/src/amarokcore -I../../../amarok/src/engine -I../../../amarok/src/plugin -I../../../amarok/src -I/usr/kde/3.5/include -I/usr/qt/3/include -I.  -I/usr/kde/3.5/include  -DQT_THREAD_SUPPORT  -D_REENTRANT  -Wno-long-long -Wundef -ansi -D_XOPEN_SOURCE=500 -D_BSD_SOURCE -Wcast-align -Wconversion -Wchar-subscripts -Wall -W -Wpointer-arith -DNDEBUG -DNO_DEBUG -O2 -march=athlon-xp -pipe -O2 -fno-inline -Wformat-security -Wmissing-format-attribute -Wno-non-virtual-dtor -fno-exceptions -fno-check-new -fno-common -DQT_CLEAN_NAMESPACE -DQT_NO_ASCII_CAST -DQT_NO_STL -DQT_NO_COMPAT -DQT_NO_TRANSLATION  -c -o glanalyzer2.lo glanalyzer2.cpp
/bin/sh ../../../libtool --silent --tag=CXX --mode=compile i686-pc-linux-gnu-g++ -DHAVE_CONFIG_H -I. -I. -I../../.. -I../../../amarok/src/amarokcore -I../../../amarok/src -I../../../amarok/src/amarokcore -I../../../amarok/src/engine -I../../../amarok/src/plugin -I../../../amarok/src -I/usr/kde/3.5/include -I/usr/qt/3/include -I.  -I/usr/kde/3.5/include  -DQT_THREAD_SUPPORT  -D_REENTRANT  -Wno-long-long -Wundef -ansi -D_XOPEN_SOURCE=500 -D_BSD_SOURCE -Wcast-align -Wconversion -Wchar-subscripts -Wall -W -Wpointer-arith -DNDEBUG -DNO_DEBUG -O2 -march=athlon-xp -pipe -O2 -fno-inline -Wformat-security -Wmissing-format-attribute -Wno-non-virtual-dtor -fno-exceptions -fno-check-new -fno-common -DQT_CLEAN_NAMESPACE -DQT_NO_ASCII_CAST -DQT_NO_STL -DQT_NO_COMPAT -DQT_NO_TRANSLATION  -c -o glanalyzer3.lo glanalyzer3.cpp
/bin/sh ../../../libtool --silent --tag=CXX --mode=compile i686-pc-linux-gnu-g++ -DHAVE_CONFIG_H -I. -I. -I../../.. -I../../../amarok/src/amarokcore -I../../../amarok/src -I../../../amarok/src/amarokcore -I../../../amarok/src/engine -I../../../amarok/src/plugin -I../../../amarok/src -I/usr/kde/3.5/include -I/usr/qt/3/include -I.  -I/usr/kde/3.5/include  -DQT_THREAD_SUPPORT  -D_REENTRANT  -Wno-long-long -Wundef -ansi -D_XOPEN_SOURCE=500 -D_BSD_SOURCE -Wcast-align -Wconversion -Wchar-subscripts -Wall -W -Wpointer-arith -DNDEBUG -DNO_DEBUG -O2 -march=athlon-xp -pipe -O2 -fno-inline -Wformat-security -Wmissing-format-attribute -Wno-non-virtual-dtor -fno-exceptions -fno-check-new -fno-common -DQT_CLEAN_NAMESPACE -DQT_NO_ASCII_CAST -DQT_NO_STL -DQT_NO_COMPAT -DQT_NO_TRANSLATION  -c -o sonogram.lo sonogram.cpp
/bin/sh ../../../libtool --silent --tag=CXX --mode=compile i686-pc-linux-gnu-g++ -DHAVE_CONFIG_H -I. -I. -I../../.. -I../../../amarok/src/amarokcore -I../../../amarok/src -I../../../amarok/src/amarokcore -I../../../amarok/src/engine -I../../../amarok/src/plugin -I../../../amarok/src -I/usr/kde/3.5/include -I/usr/qt/3/include -I.  -I/usr/kde/3.5/include  -DQT_THREAD_SUPPORT  -D_REENTRANT  -Wno-long-long -Wundef -ansi -D_XOPEN_SOURCE=500 -D_BSD_SOURCE -Wcast-align -Wconversion -Wchar-subscripts -Wall -W -Wpointer-arith -DNDEBUG -DNO_DEBUG -O2 -march=athlon-xp -pipe -O2 -fno-inline -Wformat-security -Wmissing-format-attribute -Wno-non-virtual-dtor -fno-exceptions -fno-check-new -fno-common -DQT_CLEAN_NAMESPACE -DQT_NO_ASCII_CAST -DQT_NO_STL -DQT_NO_COMPAT -DQT_NO_TRANSLATION  -c -o turbine.lo turbine.cpp
/usr/qt/3/bin/moc ./boomanalyzer.h -o boomanalyzer.moc
/bin/sh ../../../libtool --silent --tag=CXX --mode=compile i686-pc-linux-gnu-g++ -DHAVE_CONFIG_H -I. -I. -I../../.. -I../../../amarok/src/amarokcore -I../../../amarok/src -I../../../amarok/src/amarokcore -I../../../amarok/src/engine -I../../../amarok/src/plugin -I../../../amarok/src -I/usr/kde/3.5/include -I/usr/qt/3/include -I.  -I/usr/kde/3.5/include  -DQT_THREAD_SUPPORT  -D_REENTRANT  -Wno-long-long -Wundef -ansi -D_XOPEN_SOURCE=500 -D_BSD_SOURCE -Wcast-align -Wconversion -Wchar-subscripts -Wall -W -Wpointer-arith -DNDEBUG -DNO_DEBUG -O2 -march=athlon-xp -pipe -O2 -fno-inline -Wformat-security -Wmissing-format-attribute -Wno-non-virtual-dtor -fno-exceptions -fno-check-new -fno-common -DQT_CLEAN_NAMESPACE -DQT_NO_ASCII_CAST -DQT_NO_STL -DQT_NO_COMPAT -DQT_NO_TRANSLATION  -c -o analyzerbase.lo analyzerbase.cpp
/bin/sh ../../../libtool --silent --tag=CXX --mode=compile i686-pc-linux-gnu-g++ -DHAVE_CONFIG_H -I. -I. -I../../.. -I../../../amarok/src/amarokcore -I../../../amarok/src -I../../../amarok/src/amarokcore -I../../../amarok/src/engine -I../../../amarok/src/plugin -I../../../amarok/src -I/usr/kde/3.5/include -I/usr/qt/3/include -I.  -I/usr/kde/3.5/include  -DQT_THREAD_SUPPORT  -D_REENTRANT  -Wno-long-long -Wundef -ansi -D_XOPEN_SOURCE=500 -D_BSD_SOURCE -Wcast-align -Wconversion -Wchar-subscripts -Wall -W -Wpointer-arith -DNDEBUG -DNO_DEBUG -O2 -march=athlon-xp -pipe -O2 -fno-inline -Wformat-security -Wmissing-format-attribute -Wno-non-virtual-dtor -fno-exceptions -fno-check-new -fno-common -DQT_CLEAN_NAMESPACE -DQT_NO_ASCII_CAST -DQT_NO_STL -DQT_NO_COMPAT -DQT_NO_TRANSLATION  -c -o boomanalyzer.lo boomanalyzer.cpp
/bin/sh ../../../libtool --silent --tag=CXX --mode=link i686-pc-linux-gnu-g++  -Wno-long-long -Wundef -ansi -D_XOPEN_SOURCE=500 -D_BSD_SOURCE -Wcast-align -Wconversion -Wchar-subscripts -Wall -W -Wpointer-arith -DNDEBUG -DNO_DEBUG -O2 -march=athlon-xp -pipe -O2 -fno-inline -Wformat-security -Wmissing-format-attribute -Wno-non-virtual-dtor -fno-exceptions -fno-check-new -fno-common -DQT_CLEAN_NAMESPACE -DQT_NO_ASCII_CAST -DQT_NO_STL -DQT_NO_COMPAT -DQT_NO_TRANSLATION    -o libanalyzers.la   analyzerbase.lo analyzerfactory.lo baranalyzer.lo blockanalyzer.lo glanalyzer.lo glanalyzer2.lo glanalyzer3.lo sonogram.lo turbine.lo boomanalyzer.lo
make[4]: Leaving directory `/var/tmp/portage/amarok-1.4.1-r2/work/amarok-1.4.1/amarok/src/analyzers'
Making all in data
make[4]: Entering directory `/var/tmp/portage/amarok-1.4.1-r2/work/amarok-1.4.1/amarok/src/data'
make[4]: Цель `all' не требует выполнения команд.
make[4]: Leaving directory `/var/tmp/portage/amarok-1.4.1-r2/work/amarok-1.4.1/amarok/src/data'
Making all in plugin
make[4]: Entering directory `/var/tmp/portage/amarok-1.4.1-r2/work/amarok-1.4.1/amarok/src/plugin'
/bin/sh ../../../libtool --silent --tag=CXX --mode=compile i686-pc-linux-gnu-g++ -DHAVE_CONFIG_H -I. -I. -I../../.. -I/usr/kde/3.5/include -I/usr/qt/3/include -I.  -I/usr/kde/3.5/include  -DQT_THREAD_SUPPORT  -D_REENTRANT  -Wno-long-long -Wundef -ansi -D_XOPEN_SOURCE=500 -D_BSD_SOURCE -Wcast-align -Wconversion -Wchar-subscripts -Wall -W -Wpointer-arith -DNDEBUG -DNO_DEBUG -O2 -march=athlon-xp -pipe -O2 -fno-inline -Wformat-security -Wmissing-format-attribute -Wno-non-virtual-dtor -fno-exceptions -fno-check-new -fno-common -DQT_CLEAN_NAMESPACE -DQT_NO_ASCII_CAST -DQT_NO_STL -DQT_NO_COMPAT -DQT_NO_TRANSLATION  -c -o plugin.lo plugin.cpp
/usr/qt/3/bin/moc ./pluginconfig.h -o pluginconfig.moc.cpp
/bin/sh ../../../libtool --silent --tag=CXX --mode=compile i686-pc-linux-gnu-g++ -DHAVE_CONFIG_H -I. -I. -I../../.. -I/usr/kde/3.5/include -I/usr/qt/3/include -I.  -I/usr/kde/3.5/include  -DQT_THREAD_SUPPORT  -D_REENTRANT  -Wno-long-long -Wundef -ansi -D_XOPEN_SOURCE=500 -D_BSD_SOURCE -Wcast-align -Wconversion -Wchar-subscripts -Wall -W -Wpointer-arith -DNDEBUG -DNO_DEBUG -O2 -march=athlon-xp -pipe -O2 -fno-inline -Wformat-security -Wmissing-format-attribute -Wno-non-virtual-dtor -fno-exceptions -fno-check-new -fno-common -DQT_CLEAN_NAMESPACE -DQT_NO_ASCII_CAST -DQT_NO_STL -DQT_NO_COMPAT -DQT_NO_TRANSLATION  -c -o pluginconfig.moc.lo pluginconfig.moc.cpp
/bin/sh ../../../libtool --silent --tag=CXX --mode=link i686-pc-linux-gnu-g++  -Wno-long-long -Wundef -ansi -D_XOPEN_SOURCE=500 -D_BSD_SOURCE -Wcast-align -Wconversion -Wchar-subscripts -Wall -W -Wpointer-arith -DNDEBUG -DNO_DEBUG -O2 -march=athlon-xp -pipe -O2 -fno-inline -Wformat-security -Wmissing-format-attribute -Wno-non-virtual-dtor -fno-exceptions -fno-check-new -fno-common -DQT_CLEAN_NAMESPACE -DQT_NO_ASCII_CAST -DQT_NO_STL -DQT_NO_COMPAT -DQT_NO_TRANSLATION    -o libplugin.la   plugin.lo pluginconfig.moc.lo
make[4]: Leaving directory `/var/tmp/portage/amarok-1.4.1-r2/work/amarok-1.4.1/amarok/src/plugin'
Making all in images
make[4]: Entering directory `/var/tmp/portage/amarok-1.4.1-r2/work/amarok-1.4.1/amarok/src/images'
Making all in icons
make[5]: Entering directory `/var/tmp/portage/amarok-1.4.1-r2/work/amarok-1.4.1/amarok/src/images/icons'
make[5]: Цель `all' не требует выполнения команд.
make[5]: Leaving directory `/var/tmp/portage/amarok-1.4.1-r2/work/amarok-1.4.1/amarok/src/images/icons'
make[5]: Entering directory `/var/tmp/portage/amarok-1.4.1-r2/work/amarok-1.4.1/amarok/src/images'
make[5]: Цель `all-am' не требует выполнения команд.
make[5]: Leaving directory `/var/tmp/portage/amarok-1.4.1-r2/work/amarok-1.4.1/amarok/src/images'
make[4]: Leaving directory `/var/tmp/portage/amarok-1.4.1-r2/work/amarok-1.4.1/amarok/src/images'
Making all in loader
make[4]: Entering directory `/var/tmp/portage/amarok-1.4.1-r2/work/amarok-1.4.1/amarok/src/loader'
i686-pc-linux-gnu-g++ -DHAVE_CONFIG_H -I. -I. -I../../.. -I/usr/kde/3.5/include -I/usr/qt/3/include -I.  -I/usr/kde/3.5/include  -DQT_THREAD_SUPPORT  -D_REENTRANT  -Wno-long-long -Wundef -ansi -D_XOPEN_SOURCE=500 -D_BSD_SOURCE -Wcast-align -Wconversion -Wchar-subscripts -Wall -W -Wpointer-arith -DNDEBUG -DNO_DEBUG -O2 -march=athlon-xp -pipe -O2 -fno-inline -Wformat-security -Wmissing-format-attribute -Wno-non-virtual-dtor -fno-exceptions -fno-check-new -fno-common -DQT_CLEAN_NAMESPACE -DQT_NO_ASCII_CAST -DQT_NO_STL -DQT_NO_COMPAT -DQT_NO_TRANSLATION  -c -o loader.o loader.cpp
i686-pc-linux-gnu-g++ -DHAVE_CONFIG_H -I. -I. -I../../.. -I/usr/kde/3.5/include -I/usr/qt/3/include -I.  -I/usr/kde/3.5/include  -DQT_THREAD_SUPPORT  -D_REENTRANT  -Wno-long-long -Wundef -ansi -D_XOPEN_SOURCE=500 -D_BSD_SOURCE -Wcast-align -Wconversion -Wchar-subscripts -Wall -W -Wpointer-arith -DNDEBUG -DNO_DEBUG -O2 -march=athlon-xp -pipe -O2 -fno-inline -Wformat-security -Wmissing-format-attribute -Wno-non-virtual-dtor -fno-exceptions -fno-check-new -fno-common -DQT_CLEAN_NAMESPACE -DQT_NO_ASCII_CAST -DQT_NO_STL -DQT_NO_COMPAT -DQT_NO_TRANSLATION  -c -o splash.o splash.cpp
/bin/sh ../../../libtool --silent --tag=CXX --mode=link i686-pc-linux-gnu-g++  -Wno-long-long -Wundef -ansi -D_XOPEN_SOURCE=500 -D_BSD_SOURCE -Wcast-align -Wconversion -Wchar-subscripts -Wall -W -Wpointer-arith -DNDEBUG -DNO_DEBUG -O2 -march=athlon-xp -pipe -O2 -fno-inline -Wformat-security -Wmissing-format-attribute -Wno-non-virtual-dtor -fno-exceptions -fno-check-new -fno-common -DQT_CLEAN_NAMESPACE -DQT_NO_ASCII_CAST -DQT_NO_STL -DQT_NO_COMPAT -DQT_NO_TRANSLATION    -o amarok -L/usr/kde/3.5/lib -L/usr/qt/3/lib -L/usr/lib    -L/usr/kde/3.5/lib -R /usr/lib -R /usr/kde/3.5/lib -R /usr/qt/3/lib -R /usr/lib -R /usr/kde/3.5/lib loader.o splash.o -lqt-mt  -lz -lpng -lz -lm -lXext -lX11  -lSM -lICE -lpthread -lkdecore
make[4]: Leaving directory `/var/tmp/portage/amarok-1.4.1-r2/work/amarok-1.4.1/amarok/src/loader'
Making all in scripts
make[4]: Entering directory `/var/tmp/portage/amarok-1.4.1-r2/work/amarok-1.4.1/amarok/src/scripts'
Making all in common
make[5]: Entering directory `/var/tmp/portage/amarok-1.4.1-r2/work/amarok-1.4.1/amarok/src/scripts/common'
make[5]: Цель `all' не требует выполнения команд.
make[5]: Leaving directory `/var/tmp/portage/amarok-1.4.1-r2/work/amarok-1.4.1/amarok/src/scripts/common'
Making all in lyrics_astraweb
make[5]: Entering directory `/var/tmp/portage/amarok-1.4.1-r2/work/amarok-1.4.1/amarok/src/scripts/lyrics_astraweb'
make[5]: Цель `all' не требует выполнения команд.
make[5]: Leaving directory `/var/tmp/portage/amarok-1.4.1-r2/work/amarok-1.4.1/amarok/src/scripts/lyrics_astraweb'
Making all in lyrics_lyrc
make[5]: Entering directory `/var/tmp/portage/amarok-1.4.1-r2/work/amarok-1.4.1/amarok/src/scripts/lyrics_lyrc'
make[5]: Цель `all' не требует выполнения команд.
make[5]: Leaving directory `/var/tmp/portage/amarok-1.4.1-r2/work/amarok-1.4.1/amarok/src/scripts/lyrics_lyrc'
Making all in playlist2html
make[5]: Entering directory `/var/tmp/portage/amarok-1.4.1-r2/work/amarok-1.4.1/amarok/src/scripts/playlist2html'
make[5]: Цель `all' не требует выполнения команд.
make[5]: Leaving directory `/var/tmp/portage/amarok-1.4.1-r2/work/amarok-1.4.1/amarok/src/scripts/playlist2html'
Making all in ruby_debug
make[5]: Entering directory `/var/tmp/portage/amarok-1.4.1-r2/work/amarok-1.4.1/amarok/src/scripts/ruby_debug'
make[5]: Цель `all' не требует выполнения команд.
make[5]: Leaving directory `/var/tmp/portage/amarok-1.4.1-r2/work/amarok-1.4.1/amarok/src/scripts/ruby_debug'
Making all in score_default
make[5]: Entering directory `/var/tmp/portage/amarok-1.4.1-r2/work/amarok-1.4.1/amarok/src/scripts/score_default'
make[5]: Цель `all' не требует выполнения команд.
make[5]: Leaving directory `/var/tmp/portage/amarok-1.4.1-r2/work/amarok-1.4.1/amarok/src/scripts/score_default'
Making all in score_impulsive
make[5]: Entering directory `/var/tmp/portage/amarok-1.4.1-r2/work/amarok-1.4.1/amarok/src/scripts/score_impulsive'
make[5]: Цель `all' не требует выполнения команд.
make[5]: Leaving directory `/var/tmp/portage/amarok-1.4.1-r2/work/amarok-1.4.1/amarok/src/scripts/score_impulsive'
Making all in templates
make[5]: Entering directory `/var/tmp/portage/amarok-1.4.1-r2/work/amarok-1.4.1/amarok/src/scripts/templates'
make[5]: Цель `all' не требует выполнения команд.
make[5]: Leaving directory `/var/tmp/portage/amarok-1.4.1-r2/work/amarok-1.4.1/amarok/src/scripts/templates'
Making all in webcontrol
make[5]: Entering directory `/var/tmp/portage/amarok-1.4.1-r2/work/amarok-1.4.1/amarok/src/scripts/webcontrol'
make[5]: Цель `all' не требует выполнения команд.
make[5]: Leaving directory `/var/tmp/portage/amarok-1.4.1-r2/work/amarok-1.4.1/amarok/src/scripts/webcontrol'
make[5]: Entering directory `/var/tmp/portage/amarok-1.4.1-r2/work/amarok-1.4.1/amarok/src/scripts'
make[5]: Цель `all-am' не требует выполнения команд.
make[5]: Leaving directory `/var/tmp/portage/amarok-1.4.1-r2/work/amarok-1.4.1/amarok/src/scripts'
make[4]: Leaving directory `/var/tmp/portage/amarok-1.4.1-r2/work/amarok-1.4.1/amarok/src/scripts'
Making all in themes
make[4]: Entering directory `/var/tmp/portage/amarok-1.4.1-r2/work/amarok-1.4.1/amarok/src/themes'
Making all in example
make[5]: Entering directory `/var/tmp/portage/amarok-1.4.1-r2/work/amarok-1.4.1/amarok/src/themes/example'
make[5]: Цель `all' не требует выполнения команд.
make[5]: Leaving directory `/var/tmp/portage/amarok-1.4.1-r2/work/amarok-1.4.1/amarok/src/themes/example'
Making all in reinhardt
make[5]: Entering directory `/var/tmp/portage/amarok-1.4.1-r2/work/amarok-1.4.1/amarok/src/themes/reinhardt'
Making all in images
make[6]: Entering directory `/var/tmp/portage/amarok-1.4.1-r2/work/amarok-1.4.1/amarok/src/themes/reinhardt/images'
make[6]: Цель `all' не требует выполнения команд.
make[6]: Leaving directory `/var/tmp/portage/amarok-1.4.1-r2/work/amarok-1.4.1/amarok/src/themes/reinhardt/images'
make[6]: Entering directory `/var/tmp/portage/amarok-1.4.1-r2/work/amarok-1.4.1/amarok/src/themes/reinhardt'
make[6]: Цель `all-am' не требует выполнения команд.
make[6]: Leaving directory `/var/tmp/portage/amarok-1.4.1-r2/work/amarok-1.4.1/amarok/src/themes/reinhardt'
make[5]: Leaving directory `/var/tmp/portage/amarok-1.4.1-r2/work/amarok-1.4.1/amarok/src/themes/reinhardt'
make[5]: Entering directory `/var/tmp/portage/amarok-1.4.1-r2/work/amarok-1.4.1/amarok/src/themes'
make[5]: Цель `all-am' не требует выполнения команд.
make[5]: Leaving directory `/var/tmp/portage/amarok-1.4.1-r2/work/amarok-1.4.1/amarok/src/themes'
make[4]: Leaving directory `/var/tmp/portage/amarok-1.4.1-r2/work/amarok-1.4.1/amarok/src/themes'
Making all in vis
make[4]: Entering directory `/var/tmp/portage/amarok-1.4.1-r2/work/amarok-1.4.1/amarok/src/vis'
Making all in libvisual
make[5]: Entering directory `/var/tmp/portage/amarok-1.4.1-r2/work/amarok-1.4.1/amarok/src/vis/libvisual'
i686-pc-linux-gnu-g++ -DHAVE_CONFIG_H -I. -I. -I../../../.. -I/usr/include/libvisual-0.4   -I/usr/include/SDL -D_GNU_SOURCE=1 -D_REENTRANT  -DQT_THREAD_SUPPORT  -D_REENTRANT  -Wno-long-long -Wundef -ansi -D_XOPEN_SOURCE=500 -D_BSD_SOURCE -Wcast-align -Wconversion -Wchar-subscripts -Wall -W -Wpointer-arith -DNDEBUG -DNO_DEBUG -O2 -march=athlon-xp -pipe -O2 -fno-inline -Wformat-security -Wmissing-format-attribute -Wno-non-virtual-dtor -fno-exceptions -fno-check-new -fno-common -DQT_CLEAN_NAMESPACE -DQT_NO_ASCII_CAST -DQT_NO_STL -DQT_NO_COMPAT -DQT_NO_TRANSLATION  -c -o libvisual.o libvisual.cpp
/bin/sh ../../../../libtool --silent --tag=CXX --mode=link i686-pc-linux-gnu-g++  -Wno-long-long -Wundef -ansi -D_XOPEN_SOURCE=500 -D_BSD_SOURCE -Wcast-align -Wconversion -Wchar-subscripts -Wall -W -Wpointer-arith -DNDEBUG -DNO_DEBUG -O2 -march=athlon-xp -pipe -O2 -fno-inline -Wformat-security -Wmissing-format-attribute -Wno-non-virtual-dtor -fno-exceptions -fno-check-new -fno-common -DQT_CLEAN_NAMESPACE -DQT_NO_ASCII_CAST -DQT_NO_STL -DQT_NO_COMPAT -DQT_NO_TRANSLATION    -o amarok_libvisual -lpthread -lm -ldl -lvisual-0.4   -lSDL -lpthread libvisual.o
/usr/lib/libSDL.so: undefined reference to `BlitRGBtoRGBPixelAlphaMMX3DNOW'
collect2: ld returned 1 exit status
make[5]: *** [amarok_libvisual] Ошибка 1
make[5]: Leaving directory `/var/tmp/portage/amarok-1.4.1-r2/work/amarok-1.4.1/amarok/src/vis/libvisual'
make[4]: *** [all-recursive] Ошибка 1
make[4]: Leaving directory `/var/tmp/portage/amarok-1.4.1-r2/work/amarok-1.4.1/amarok/src/vis'
make[3]: *** [all-recursive] Ошибка 1
make[3]: Leaving directory `/var/tmp/portage/amarok-1.4.1-r2/work/amarok-1.4.1/amarok/src'
make[2]: *** [all-recursive] Ошибка 1
make[2]: Leaving directory `/var/tmp/portage/amarok-1.4.1-r2/work/amarok-1.4.1/amarok'
make[1]: *** [all-recursive] Ошибка 1
make[1]: Leaving directory `/var/tmp/portage/amarok-1.4.1-r2/work/amarok-1.4.1'
make: *** [all] Ошибка 2

!!! ERROR: media-sound/amarok-1.4.1-r2 failed.
Call stack:
  ebuild.sh, line 1545:   Called dyn_compile
  ebuild.sh, line 940:   Called src_compile
  amarok-1.4.1-r2.ebuild, line 77:   Called kde_src_compile
  kde.eclass, line 164:   Called kde_src_compile 'all'
  kde.eclass, line 306:   Called kde_src_compile 'myconf' 'configure' 'make'
  kde.eclass, line 302:   Called die

!!! died running emake, kde_src_compile:make
!!! If you need support, post the topmost build error, and the call stack if relevant.

hot-serv zen #