All pastes #956428 Raw Edit

Mine

public text v1 · immutable
#956428 ·published 2008-03-25 08:53 UTC
rendered paste body
g++ ./src/lib.cpp -pipe -ftemplate-depth-20 -march=pentium4 -mtune=pentium4  -O3
 -freorder-blocks-and-partition -fgcse-las  --fast-math -fsingle-precision-const
ant -fbranch-target-load-optimize -fbranch-target-load-optimize2 -funswitch-loop
s -floop-optimize -floop-optimize2 -fprefetch-loop-arrays -fomit-frame-pointer -
s -mfpmath=sse,387   -lportaudio -lpthread  `sdl-config --cflags --libs`  -lasou
nd  -ljack  -lvorbisfile -lsndfile  -DMake_OS=Linux -DMake_DeviceAudioOutputOSS=
0 -DMake_DeviceAudioOutputDirectSound=No -DMake_DeviceAudioOutputCoreAudio=No -D
Make_DeviceAudioOutputALSA=0 -DMake_DeviceAudioOutputSDL=1 -DMake_DeviceAudioOut
putPortAudio=0 -DMake_DeviceAudioOutputBenchmark=0 -DMake_DeviceAudioOutputJack=
0 -DMake_DeviceAudioOutputDisk=0 -DMake_Debug=0 -DMake_DebugToDo=0 -DMake_MaxFlo
atError=0.0001 -DMake_SloppyNormalize=1 -DMake_SloppyNormalize_UpperLimit=1.0000
1 -DMake_SloppyNormalize_LowerLimit=0.99999 -DMake_SloppyNormalize_GuessSteps=2
-DMake_Container_BlockSize=16 -DMake_SoundChunk_MaxSize=8000 -DMake_DeviceAudioO
utput_OutputBits=16 -DMake_DeviceAudioOutputDefault=DeviceAudioOutputSDL -fPIC -
shared -Wl,-soname,3dras32.dll -o ./bin/3dras32.dll
./src/lib.cpp:1: warning: -fPIC ignored for target (all code is position indepen
dent)
In file included from ./src/misc/base.hpp:1034,
                 from ./src/misc/config.cpp:3,
                 from ./src/misc/config.hpp:61,
                 from ./src/sound.hpp:5,
                 from ./src/lib.cpp:1:
./src/misc/base.cpp: In destructor `virtual ContainerArray<T>::~ContainerArray()
':
./src/misc/base.cpp:1250: error: there are no arguments to `sleep' that depend o
n a template parameter, so a declaration of `sleep' must be available
./src/misc/base.cpp:1250: error: (if you use `-fpermissive', G++ will accept you
r code, but allowing the use of an undeclared name is deprecated)
./src/misc/base.cpp: In destructor `virtual ContainerStdVector<T>::~ContainerStd
Vector()':
./src/misc/base.cpp:1401: error: there are no arguments to `sleep' that depend o
n a template parameter, so a declaration of `sleep' must be available
In file included from ./src/sound.hpp:783,
                 from ./src/lib.cpp:1:
./src/sound.cpp:4:21: sndfile.h: No such file or directory
In file included from ./src/sound.hpp:783,
                 from ./src/lib.cpp:1:
./src/sound.cpp: In member function `void SoundChunk::ResampleDown(const Amount&
)':
./src/sound.cpp:845: warning: converting to `Amount' from `float'
./src/sound.cpp: In member function `void SoundChunk::LowPassExponentialAverageF
ilter(const Frequency&, const Frequency&)':
./src/sound.cpp:967: error: `isnan' was not declared in this scope
./src/sound.cpp:982: error: `isinf' was not declared in this scope
./src/sound.cpp:988: error: `isinf' was not declared in this scope
./src/sound.cpp: In constructor `SoundDataBuffer::SoundDataBuffer(const char*)':

./src/sound.cpp:1734: error: `SNDFILE' was not declared in this scope
./src/sound.cpp:1734: error: `inputfile' was not declared in this scope
./src/sound.cpp:1735: error: `SF_INFO' was not declared in this scope
./src/sound.cpp:1735: error: expected `;' before "info"
./src/sound.cpp:1736: error: `SFM_READ' was not declared in this scope
./src/sound.cpp:1736: error: `info' was not declared in this scope
./src/sound.cpp:1736: error: `sf_open' was not declared in this scope
./src/sound.cpp:1749: error: `sf_close' was not declared in this scope
./src/sound.cpp:1752: error: `sf_read_float' was not declared in this scope
./src/sound.cpp:1776: error: `sf_close' was not declared in this scope
make: *** [lib] Error 1