All pastes #953447 Raw Edit

Unnamed

public text v1 · immutable
#953447 ·published 2008-03-23 02:10 UTC
rendered paste body
dreamland linux # emerge --update --deep world
Calculating world dependencies... done!
>>> Verifying ebuild Manifests...

>>> Emerging (1 of 13) sys-apps/busybox-1.8.2 to /
 * busybox-1.8.2.tar.bz2 RMD160 SHA1 SHA256 size ;-) ...                                             [ ok ]
 * checking ebuild checksums ;-) ...                                                                 [ ok ]
 * checking auxfile checksums ;-) ...                                                                [ ok ]
 * checking miscfile checksums ;-) ...                                                               [ ok ]
 * checking busybox-1.8.2.tar.bz2 ;-) ...                                                            [ ok ]
>>> Unpacking source...
>>> Unpacking busybox-1.8.2.tar.bz2 to /var/tmp/portage/sys-apps/busybox-1.8.2/work
 * Applying busybox-1.7.0-bb.patch ...                                                               [ ok ]
 * Applying busybox-1.7.4-signal-hack.patch ...                                                      [ ok ]
 * Could not locate user configfile, so we will save a default one
 * # CONFIG_DMALLOC is not set
 * # CONFIG_FEATURE_SUID_CONFIG is not set
 *
 * # CONFIG_BUILD_LIBBUSYBOX is not set
 * CONFIG_FEATURE_SH_IS_ASH=y
 * # CONFIG_FEATURE_SH_IS_NONE is not set
 * CONFIG_PAM=y
 * # CONFIG_STATIC is not set
 * # CONFIG_DEBUG is not set
 * # CONFIG_SELINUX is not set
 * # CONFIG_LOCALE_SUPPORT is not set
 * # CONFIG_TFTP is not set
 * # CONFIG_FTPGET is not set
 * # CONFIG_FTPPUT is not set
 * # CONFIG_IPCALC is not set
 * # CONFIG_TFTP is not set
 * # CONFIG_HUSH is not set
 * # CONFIG_LASH is not set
 * # CONFIG_MSH is not set
 * # CONFIG_INETD is not set
 * # CONFIG_DPKG is not set
 * # CONFIG_RPM2CPIO is not set
 * # CONFIG_RPM is not set
 * # CONFIG_FOLD is not set
 * # CONFIG_LOGNAME is not set
 * # CONFIG_OD is not set
 * # CONFIG_CRONTAB is not set
 * # CONFIG_UUDECODE is not set
 * # CONFIG_UUENCODE is not set
 * # CONFIG_SULOGIN is not set
 * # CONFIG_DC is not set
 *
 * # CONFIG_DEBUG_INIT is not set
 * # CONFIG_DEBUG_CROND_OPTION is not set
 * # CONFIG_FEATURE_UDHCP_DEBUG is not set
 * # CONFIG_TASKSET is not set
>>> Source unpacked.
>>> Compiling source in /var/tmp/portage/sys-apps/busybox-1.8.2/work/busybox-1.8.2 ...
  SPLIT   include/autoconf.h -> include/config/*
  GEN     include/bbconfigopts.h
/var/tmp/portage/sys-apps/busybox-1.8.2/work/busybox-1.8.2/scripts/gcc-version.sh: line 11: i686-pc-linux-gnu-gcc: command not found
  HOSTCC  applets/usage
  LD      archival/libunarchive/built-in.o
  LD      archival/built-in.o
  CC      archival/libunarchive/archive_xread_all_eof.o
/bin/sh: i686-pc-linux-gnu-gcc: command not found
make[1]: *** [archival/libunarchive/archive_xread_all_eof.o] Error 127
  CC      archival/ar.o
/bin/sh: i686-pc-linux-gnu-gcc: command not found
make: *** [archival/libunarchive] Error 2
make: *** Waiting for unfinished jobs....
make[1]: *** [archival/ar.o] Error 127
make: *** [archival] Error 2
  GEN     include/usage_compressed.h
  CC      applets/applets.o
/bin/sh: i686-pc-linux-gnu-gcc: command not found
make[1]: *** [applets/applets.o] Error 127
make: *** [applets] Error 2
 *
 * ERROR: sys-apps/busybox-1.8.2 failed.
 * Call stack:
 *               ebuild.sh, line   49:  Called src_compile
 *             environment, line 2435:  Called die
 * The specific snippet of code:
 *       emake busybox || die "build failed";
 *  The die message:
 *   build failed
 *
 * If you need support, post the topmost build error, and the call stack if relevant.
 * A complete build log is located at '/var/tmp/portage/sys-apps/busybox-1.8.2/temp/build.log'.
 * The ebuild environment file is located at '/var/tmp/portage/sys-apps/busybox-1.8.2/temp/environment'.
 *

 * Messages for package sys-apps/busybox-1.8.2:

 * Could not locate user configfile, so we will save a default one
 *
 * ERROR: sys-apps/busybox-1.8.2 failed.
 * Call stack:
 *               ebuild.sh, line   49:  Called src_compile
 *             environment, line 2435:  Called die
 * The specific snippet of code:
 *       emake busybox || die "build failed";
 *  The die message:
 *   build failed
 *
 * If you need support, post the topmost build error, and the call stack if relevant.
 * A complete build log is located at '/var/tmp/portage/sys-apps/busybox-1.8.2/temp/build.log'.
 * The ebuild environment file is located at '/var/tmp/portage/sys-apps/busybox-1.8.2/temp/environment'.