All pastes #951659 Raw Edit

Someone

public text v1 · immutable
·published 2008-03-21 15:59 UTC
rendered paste body
SmorgPC vidalia-0.1.1 # cmake . && make
-- Configuring Vidalia 0.1.1
-- Check for working C compiler: /usr/bin/gcc
-- Check for working C compiler: /usr/bin/gcc -- works
-- Check size of void*
-- Check size of void* - done
-- Check for working CXX compiler: /usr/bin/c++
-- Check for working CXX compiler: /usr/bin/c++ -- works
-- Looking for Q_WS_X11
-- Looking for Q_WS_X11 - found
-- Looking for Q_WS_WIN
-- Looking for Q_WS_WIN - not found.
-- Looking for Q_WS_QWS
-- Looking for Q_WS_QWS - not found.
-- Looking for Q_WS_MAC
-- Looking for Q_WS_MAC - not found.
-- Found Qt-Version 4.3.4
-- Looking for _POSIX_TIMERS
-- Looking for _POSIX_TIMERS - found
-- Found Qt-Version 4.3.4
-- Looking for C++ include qsslsocket.h
-- Looking for C++ include qsslsocket.h - found
-- Looking for QT_NO_OPENSSL
-- Looking for QT_NO_OPENSSL - not found.
-- Looking for OpenSSL libraries
-- Looking for OpenSSL libraries - found
-- Configuring done
-- Generating done
-- Build files have been written to: /home/smorg/vidalia-0.1.1
[  0%] Generating moc_torprocess.cxx
[  1%] Generating moc_controlconnection.cxx
[  1%] Generating moc_controlsocket.cxx
[  1%] Generating moc_torcontrol.cxx
[  2%] Generating moc_torevents.cxx
Scanning dependencies of target torcontrol
[  2%] Building CXX object src/torcontrol/CMakeFiles/torcontrol.dir/addressmap.o
[  2%] Building CXX object src/torcontrol/CMakeFiles/torcontrol.dir/circuit.o
[  3%] Building CXX object src/torcontrol/CMakeFiles/torcontrol.dir/clientstatusevent.o
[  3%] Building CXX object src/torcontrol/CMakeFiles/torcontrol.dir/controlcommand.o
[  4%] Building CXX object src/torcontrol/CMakeFiles/torcontrol.dir/controlconnection.o
[  4%] Building CXX object src/torcontrol/CMakeFiles/torcontrol.dir/controlreply.o
[  5%] Building CXX object src/torcontrol/CMakeFiles/torcontrol.dir/controlsocket.o
[  5%] Building CXX object src/torcontrol/CMakeFiles/torcontrol.dir/dangerousversionevent.o
[  6%] Building CXX object src/torcontrol/CMakeFiles/torcontrol.dir/generalstatusevent.o
[  6%] Building CXX object src/torcontrol/CMakeFiles/torcontrol.dir/logevent.o
[  6%] Building CXX object src/torcontrol/CMakeFiles/torcontrol.dir/orconnevent.o
[  7%] Building CXX object src/torcontrol/CMakeFiles/torcontrol.dir/protocolinfo.o
[  7%] Building CXX object src/torcontrol/CMakeFiles/torcontrol.dir/replyline.o
[  8%] Building CXX object src/torcontrol/CMakeFiles/torcontrol.dir/routerdescriptor.o
[  8%] Building CXX object src/torcontrol/CMakeFiles/torcontrol.dir/serverstatusevent.o
[  9%] Building CXX object src/torcontrol/CMakeFiles/torcontrol.dir/statusevent.o
[  9%] Building CXX object src/torcontrol/CMakeFiles/torcontrol.dir/stream.o
[ 10%] Building CXX object src/torcontrol/CMakeFiles/torcontrol.dir/torcontrol.o
[ 10%] Building CXX object src/torcontrol/CMakeFiles/torcontrol.dir/torevents.o
[ 10%] Building CXX object src/torcontrol/CMakeFiles/torcontrol.dir/torprocess.o
[ 11%] Building CXX object src/torcontrol/CMakeFiles/torcontrol.dir/torsignal.o
[ 11%] Building CXX object src/torcontrol/CMakeFiles/torcontrol.dir/moc_controlconnection.o
[ 12%] Building CXX object src/torcontrol/CMakeFiles/torcontrol.dir/moc_controlsocket.o
[ 12%] Building CXX object src/torcontrol/CMakeFiles/torcontrol.dir/moc_torcontrol.o
[ 13%] Building CXX object src/torcontrol/CMakeFiles/torcontrol.dir/moc_torevents.o
[ 13%] Building CXX object src/torcontrol/CMakeFiles/torcontrol.dir/moc_torprocess.o
Linking CXX static library libtorcontrol.a
[ 13%] Built target torcontrol
[ 14%] Generating moc_torsslsocket.cxx
[ 14%] Generating moc_torsocket.cxx
Scanning dependencies of target util
[ 15%] Building CXX object src/util/CMakeFiles/util.dir/crypto.o
/home/smorg/vidalia-0.1.1/src/util/crypto.cpp: In function 'quint32 crypto_rand_quint32(quint32)':
/home/smorg/vidalia-0.1.1/src/util/crypto.cpp:134: error: 'UINT_MAX' was not declared in this scope
make[2]: *** [src/util/CMakeFiles/util.dir/crypto.o] Error 1
make[1]: *** [src/util/CMakeFiles/util.dir/all] Error 2
make: *** [all] Error 2