make KBUILD_VERBOSE=1 -C /lib/modules/2.6.22.9-laptop-1mdv/build SUBDIRS=/tmp/vbox.4 SRCROOT=/tmp/vbox.4 modules
make[1]: Entering directory `/usr/src/linux-2.6.22.9-laptop-1mdv'
test -e include/linux/autoconf.h -a -e include/config/auto.conf || ( \
echo; \
echo " ERROR: Kernel configuration is invalid."; \
echo " include/linux/autoconf.h or include/config/auto.conf are missing."; \
echo " Run 'make oldconfig && make prepare' on kernel src to fix it."; \
echo; \
/bin/false)
ERROR: Kernel configuration is invalid.
include/linux/autoconf.h or include/config/auto.conf are missing.
Run 'make oldconfig && make prepare' on kernel src to fix it.
mkdir -p /tmp/vbox.4/.tmp_versions
rm -f /tmp/vbox.4/.tmp_versions/*
WARNING: Symbol version dump /usr/src/linux-2.6.22.9-laptop-1mdv/Module.symvers
is missing; modules will have no dependencies and modversions.
make -f scripts/Makefile.build obj=/tmp/vbox.4
gcc -m32 -Wp,-MD,/tmp/vbox.4/linux/.SUPDrv-linux.o.d -nostdinc -isystem /usr/lib/gcc/i586-mandriva-linux-gnu/4.2.2/include -D__KERNEL__ -Iinclude -include include/linux/autoconf.h -Wall -Wundef -Wstrict-prototypes -Wno-trigraphs -fno-strict-aliasing -fno-common -O2 -pipe -msoft-float -mregparm=3 -freg-struct-return -mpreferred-stack-boundary=2 -ffreestanding -maccumulate-outgoing-args -DCONFIG_AS_CFI=1 -DCONFIG_AS_CFI_SIGNAL_FRAME=1 -Iinclude/asm-i386/mach-default -fomit-frame-pointer -fno-stack-protector -Wdeclaration-after-statement -Wno-pointer-sign -I/lib/modules/2.6.22.9-laptop-1mdv/build/include -I/tmp/vbox.4/ -I/tmp/vbox.4/include -I/tmp/vbox.4/r0drv/linux -D__KERNEL__ -DMODULE -DRT_OS_LINUX -DIN_RING0 -DIN_RT_R0 -DIN_SUP_R0 -DCONFIG_VBOXDRV_AS_MISC -DRT_ARCH_X86 -DVBOX_WITHOUT_IDT_PATCHING -DUSE_NEW_OS_INTERFACE_FOR_MM -DMODULE -D"KBUILD_STR(s)=#s" -D"KBUILD_BASENAME=KBUILD_STR(SUPDrv_linux)" -D"KBUILD_MODNAME=KBUILD_STR(vboxdrv)" -c -o /tmp/vbox.4/linux/SUPDrv-linux.o /tmp/vbox.4/linux/SUPDrv-linux.c
cc1: error: include/linux/autoconf.h: No such file or directory
In file included from /tmp/vbox.4/include/VBox/types.h:21,
from /tmp/vbox.4/SUPDRV.h:26,
from /tmp/vbox.4/linux/SUPDrv-linux.c:22:
/tmp/vbox.4/include/iprt/types.h:74:30: error: linux/autoconf.h: No such file or directory
In file included from include/linux/types.h:14,
from /tmp/vbox.4/include/iprt/types.h:75,
from /tmp/vbox.4/include/VBox/types.h:21,
from /tmp/vbox.4/SUPDRV.h:26,
from /tmp/vbox.4/linux/SUPDrv-linux.c:22:
include/linux/posix_types.h:47:29: error: asm/posix_types.h: No such file or directory
In file included from /tmp/vbox.4/include/iprt/types.h:75,
from /tmp/vbox.4/include/VBox/types.h:21,
from /tmp/vbox.4/SUPDRV.h:26,
from /tmp/vbox.4/linux/SUPDrv-linux.c:22:
include/linux/types.h:15:23: error: asm/types.h: No such file or directory
In file included from /tmp/vbox.4/include/iprt/types.h:75,
from /tmp/vbox.4/include/VBox/types.h:21,
from /tmp/vbox.4/SUPDRV.h:26,
from /tmp/vbox.4/linux/SUPDrv-linux.c:22:
include/linux/types.h:19: error: expected ‘=’, ‘,’, ‘;’, ‘asm’ or ‘__attribute__’ before ‘__kernel_dev_t’
include/linux/types.h:22: error: expected ‘=’, ‘,’, ‘;’, ‘asm’ or ‘__attribute__’ before ‘dev_t’
include/linux/types.h:23: error: expected ‘=’, ‘,’, ‘;’, ‘asm’ or ‘__attribute__’ before ‘ino_t’
include/linux/types.h:24: error: expected ‘=’, ‘,’, ‘;’, ‘asm’ or ‘__attribute__’ before ‘mode_t’
include/linux/types.h:25: error: expected ‘=’, ‘,’, ‘;’, ‘asm’ or ‘__attribute__’ before ‘nlink_t’
include/linux/types.h:26: error: expected ‘=’, ‘,’, ‘;’, ‘asm’ or ‘__attribute__’ before ‘off_t’
include/linux/types.h:27: error: expected ‘=’, ‘,’, ‘;’, ‘asm’ or ‘__attribute__’ before ‘pid_t’
include/linux/types.h:28: error: expected ‘=’, ‘,’, ‘;’, ‘asm’ or ‘__attribute__’ before ‘daddr_t’
include/linux/types.h:30: error: expected ‘=’, ‘,’, ‘;’, ‘asm’ or ‘__attribute__’ before ‘suseconds_t’
include/linux/types.h:31: error: expected ‘=’, ‘,’, ‘;’, ‘asm’ or ‘__attribute__’ before ‘timer_t’
include/linux/types.h:32: error: expected ‘=’, ‘,’, ‘;’, ‘asm’ or ‘__attribute__’ before ‘clockid_t’
include/linux/types.h:38: error: expected ‘=’, ‘,’, ‘;’, ‘asm’ or ‘__attribute__’ before ‘uid_t’
include/linux/types.h:39: error: expected ‘=’, ‘,’, ‘;’, ‘asm’ or ‘__attribute__’ before ‘gid_t’
include/linux/types.h:40: error: expected ‘=’, ‘,’, ‘;’, ‘asm’ or ‘__attribute__’ before ‘uid16_t’
include/linux/types.h:41: error: expected ‘=’, ‘,’, ‘;’, ‘asm’ or ‘__attribute__’ before ‘gid16_t’
include/linux/types.h:58: error: expected ‘=’, ‘,’, ‘;’, ‘asm’ or ‘__attribute__’ before ‘loff_t’
include/linux/types.h:72: error: expected ‘=’, ‘,’, ‘;’, ‘asm’ or ‘__attribute__’ before ‘ssize_t’
include/linux/types.h:82: error: expected ‘=’, ‘,’, ‘;’, ‘asm’ or ‘__attribute__’ before ‘time_t’
include/linux/types.h:87: error: expected ‘=’, ‘,’, ‘;’, ‘asm’ or ‘__attribute__’ before ‘clock_t’
include/linux/types.h:92: error: expected ‘=’, ‘,’, ‘;’, ‘asm’ or ‘__attribute__’ before ‘caddr_t’
include/linux/types.h:110: error: expected ‘=’, ‘,’, ‘;’, ‘asm’ or ‘__attribute__’ before ‘u_int8_t’
include/linux/types.h:111: error: expected ‘=’, ‘,’, ‘;’, ‘asm’ or ‘__attribute__’ before ‘int8_t’
include/linux/types.h:112: error: expected ‘=’, ‘,’, ‘;’, ‘asm’ or ‘__attribute__’ before ‘u_int16_t’
include/linux/types.h:113: error: expected ‘=’, ‘,’, ‘;’, ‘asm’ or ‘__attribute__’ before ‘int16_t’
include/linux/types.h:114: error: expected ‘=’, ‘,’, ‘;’, ‘asm’ or ‘__attribute__’ before ‘u_int32_t’
include/linux/types.h:115: error: expected ‘=’, ‘,’, ‘;’, ‘asm’ or ‘__attribute__’ before ‘int32_t’
include/linux/types.h:119: error: expected ‘=’, ‘,’, ‘;’, ‘asm’ or ‘__attribute__’ before ‘uint8_t’
include/linux/types.h:120: error: expected ‘=’, ‘,’, ‘;’, ‘asm’ or ‘__attribute__’ before ‘uint16_t’
include/linux/types.h:121: error: expected ‘=’, ‘,’, ‘;’, ‘asm’ or ‘__attribute__’ before ‘uint32_t’
include/linux/types.h:124: error: expected ‘=’, ‘,’, ‘;’, ‘asm’ or ‘__attribute__’ before ‘uint64_t’
include/linux/types.h:125: error: expected ‘=’, ‘,’, ‘;’, ‘asm’ or ‘__attribute__’ before ‘u_int64_t’
include/linux/types.h:126: error: expected ‘=’, ‘,’, ‘;’, ‘asm’ or ‘__attribute__’ before ‘int64_t’
include/linux/types.h:181: error: expected ‘=’, ‘,’, ‘;’, ‘asm’ or ‘__attribute__’ before ‘__le16’
include/linux/types.h:182: error: expected ‘=’, ‘,’, ‘;’, ‘asm’ or ‘__attribute__’ before ‘__be16’
include/linux/types.h:183: error: expected ‘=’, ‘,’, ‘;’, ‘asm’ or ‘__attribute__’ before ‘__le32’
include/linux/types.h:184: error: expected ‘=’, ‘,’, ‘;’, ‘asm’ or ‘__attribute__’ before ‘__be32’
include/linux/types.h:186: error: expected ‘=’, ‘,’, ‘;’, ‘asm’ or ‘__attribute__’ before ‘__le64’
include/linux/types.h:187: error: expected ‘=’, ‘,’, ‘;’, ‘asm’ or ‘__attribute__’ before ‘__be64’
include/linux/types.h:189: error: expected ‘=’, ‘,’, ‘;’, ‘asm’ or ‘__attribute__’ before ‘__sum16’
include/linux/types.h:190: error: expected ‘=’, ‘,’, ‘;’, ‘asm’ or ‘__attribute__’ before ‘__wsum’
include/linux/types.h:198: error: expected ‘=’, ‘,’, ‘;’, ‘asm’ or ‘__attribute__’ before ‘resource_size_t’
include/linux/types.h:204: error: expected specifier-qualifier-list before ‘__kernel_daddr_t’
In file included from /tmp/vbox.4/include/VBox/types.h:21,
from /tmp/vbox.4/SUPDRV.h:26,
from /tmp/vbox.4/linux/SUPDrv-linux.c:22:
/tmp/vbox.4/include/iprt/types.h:146: error: expected specifier-qualifier-list before ‘uint64_t’
/tmp/vbox.4/include/iprt/types.h:160: error: expected specifier-qualifier-list before ‘uint64_t’
/tmp/vbox.4/include/iprt/types.h:172: error: expected specifier-qualifier-list before ‘uint16_t’
/tmp/vbox.4/include/iprt/types.h:197: error: expected specifier-qualifier-list before ‘uint32_t’
/tmp/vbox.4/include/iprt/types.h:230: error: expected specifier-qualifier-list before ‘uint64_t’
/tmp/vbox.4/include/iprt/types.h:278: error: expected specifier-qualifier-list before ‘uint64_t’
/tmp/vbox.4/include/iprt/types.h:284: error: expected specifier-qualifier-list before ‘uint64_t’
/tmp/vbox.4/include/iprt/types.h:290: error: expected specifier-qualifier-list before ‘uint32_t’
/tmp/vbox.4/include/iprt/types.h:298: error: expected specifier-qualifier-list before ‘uint16_t’
/tmp/vbox.4/include/iprt/types.h:309: error: expected specifier-qualifier-list before ‘uint64_t’
/tmp/vbox.4/include/iprt/types.h:354: error: expected ‘=’, ‘,’, ‘;’, ‘asm’ or ‘__attribute__’ before ‘RTINTPTR’
/tmp/vbox.4/include/iprt/types.h:361: error: expected ‘=’, ‘,’, ‘;’, ‘asm’ or ‘__attribute__’ before ‘*’ token
/tmp/vbox.4/include/iprt/types.h:363: error: expected ‘=’, ‘,’, ‘;’, ‘asm’ or ‘__attribute__’ before ‘*’ token
/tmp/vbox.4/include/iprt/types.h:367: error: expected ‘=’, ‘,’, ‘;’, ‘asm’ or ‘__attribute__’ before ‘RTUINTPTR’
/tmp/vbox.4/include/iprt/types.h:374: error: expected ‘=’, ‘,’, ‘;’, ‘asm’ or ‘__attribute__’ before ‘*’ token
/tmp/vbox.4/include/iprt/types.h:376: error: expected ‘=’, ‘,’, ‘;’, ‘asm’ or ‘__attribute__’ before ‘*’ token
/tmp/vbox.4/include/iprt/types.h:379: error: expected ‘=’, ‘,’, ‘;’, ‘asm’ or ‘__attribute__’ before ‘RTINT’
/tmp/vbox.4/include/iprt/types.h:381: error: expected ‘=’, ‘,’, ‘;’, ‘asm’ or ‘__attribute__’ before ‘*’ token
/tmp/vbox.4/include/iprt/types.h:383: error: expected ‘=’, ‘,’, ‘;’, ‘asm’ or ‘__attribute__’ before ‘*’ token
/tmp/vbox.4/include/iprt/types.h:386: error: expected ‘=’, ‘,’, ‘;’, ‘asm’ or ‘__attribute__’ before ‘RTUINT’
/tmp/vbox.4/include/iprt/types.h:388: error: expected ‘=’, ‘,’, ‘;’, ‘asm’ or ‘__attribute__’ before ‘*’ token
/tmp/vbox.4/include/iprt/types.h:390: error: expected ‘=’, ‘,’, ‘;’, ‘asm’ or ‘__attribute__’ before ‘*’ token
/tmp/vbox.4/include/iprt/types.h:393: error: expected ‘=’, ‘,’, ‘;’, ‘asm’ or ‘__attribute__’ before ‘RTFOFF’
/tmp/vbox.4/include/iprt/types.h:395: error: expected ‘=’, ‘,’, ‘;’, ‘asm’ or ‘__attribute__’ before ‘*’ token
/tmp/vbox.4/include/iprt/types.h:398: error: expected ‘=’, ‘,’, ‘;’, ‘asm’ or ‘__attribute__’ before ‘RTFMODE’
/tmp/vbox.4/include/iprt/types.h:400: error: expected ‘=’, ‘,’, ‘;’, ‘asm’ or ‘__attribute__’ before ‘*’ token
/tmp/vbox.4/include/iprt/types.h:403: error: expected ‘=’, ‘,’, ‘;’, ‘asm’ or ‘__attribute__’ before ‘RTDEV’
/tmp/vbox.4/include/iprt/types.h:405: error: expected ‘=’, ‘,’, ‘;’, ‘asm’ or ‘__attribute__’ before ‘*’ token
/tmp/vbox.4/include/iprt/types.h:408: error: expected ‘=’, ‘,’, ‘;’, ‘asm’ or ‘__attribute__’ before ‘RTINODE’
/tmp/vbox.4/include/iprt/types.h:410: error: expected ‘=’, ‘,’, ‘;’, ‘asm’ or ‘__attribute__’ before ‘*’ token
/tmp/vbox.4/include/iprt/types.h:413: error: expected ‘=’, ‘,’, ‘;’, ‘asm’ or ‘__attribute__’ before ‘RTUID’
/tmp/vbox.4/include/iprt/types.h:415: error: expected ‘=’, ‘,’, ‘;’, ‘asm’ or ‘__attribute__’ before ‘*’ token
/tmp/vbox.4/include/iprt/types.h:421: error: expected ‘=’, ‘,’, ‘;’, ‘asm’ or ‘__attribute__’ before ‘RTGID’
/tmp/vbox.4/include/iprt/types.h:423: error: expected ‘=’, ‘,’, ‘;’, ‘asm’ or ‘__attribute__’ before ‘*’ token
/tmp/vbox.4/include/iprt/types.h:429: error: expected ‘=’, ‘,’, ‘;’, ‘asm’ or ‘__attribute__’ before ‘RTIOPORT’
/tmp/vbox.4/include/iprt/types.h:431: error: expected ‘=’, ‘,’, ‘;’, ‘asm’ or ‘__attribute__’ before ‘*’ token
/tmp/vbox.4/include/iprt/types.h:433: error: expected ‘=’, ‘,’, ‘;’, ‘asm’ or ‘__attribute__’ before ‘*’ token
/tmp/vbox.4/include/iprt/types.h:436: error: expected ‘=’, ‘,’, ‘;’, ‘asm’ or ‘__attribute__’ before ‘RTSEL’
/tmp/vbox.4/include/iprt/types.h:438: error: expected ‘=’, ‘,’, ‘;’, ‘asm’ or ‘__attribute__’ before ‘*’ token
/tmp/vbox.4/include/iprt/types.h:440: error: expected ‘=’, ‘,’, ‘;’, ‘asm’ or ‘__attribute__’ before ‘*’ token
/tmp/vbox.4/include/iprt/types.h:446: error: expected specifier-qualifier-list before ‘uint16_t’
/tmp/vbox.4/include/iprt/types.h:459: error: expected specifier-qualifier-list before ‘uint32_t’
/tmp/vbox.4/include/iprt/types.h:472: error: expected specifier-qualifier-list before ‘uint64_t’
/tmp/vbox.4/include/iprt/types.h:490: error: expected ‘=’, ‘,’, ‘;’, ‘asm’ or ‘__attribute__’ before ‘RTHCINT’
/tmp/vbox.4/include/iprt/types.h:492: error: expected ‘=’, ‘,’, ‘;’, ‘asm’ or ‘__attribute__’ before ‘*’ token
/tmp/vbox.4/include/iprt/types.h:494: error: expected ‘=’, ‘,’, ‘;’, ‘asm’ or ‘__attribute__’ before ‘*’ token
/tmp/vbox.4/include/iprt/types.h:497: error: expected ‘=’, ‘,’, ‘;’, ‘asm’ or ‘__attribute__’ before ‘RTHCUINT’
/tmp/vbox.4/include/iprt/types.h:499: error: expected ‘=’, ‘,’, ‘;’, ‘asm’ or ‘__attribute__’ before ‘*’ token
/tmp/vbox.4/include/iprt/types.h:501: error: expected ‘=’, ‘,’, ‘;’, ‘asm’ or ‘__attribute__’ before ‘*’ token
/tmp/vbox.4/include/iprt/types.h:506: error: expected ‘=’, ‘,’, ‘;’, ‘asm’ or ‘__attribute__’ before ‘RTHCINTPTR’
/tmp/vbox.4/include/iprt/types.h:513: error: expected ‘=’, ‘,’, ‘;’, ‘asm’ or ‘__attribute__’ before ‘*’ token
/tmp/vbox.4/include/iprt/types.h:515: error: expected ‘=’, ‘,’, ‘;’, ‘asm’ or ‘__attribute__’ before ‘*’ token
/tmp/vbox.4/include/iprt/types.h:519: error: expected ‘=’, ‘,’, ‘;’, ‘asm’ or ‘__attribute__’ before ‘RTR3INTPTR’
/tmp/vbox.4/include/iprt/types.h:526: error: expected ‘=’, ‘,’, ‘;’, ‘asm’ or ‘__attribute__’ before ‘*’ token
/tmp/vbox.4/include/iprt/types.h:528: error: expected ‘=’, ‘,’, ‘;’, ‘asm’ or ‘__attribute__’ before ‘*’ token
/tmp/vbox.4/include/iprt/types.h:532: error: expected ‘=’, ‘,’, ‘;’, ‘asm’ or ‘__attribute__’ before ‘RTR0INTPTR’
/tmp/vbox.4/include/iprt/types.h:539: error: expected ‘=’, ‘,’, ‘;’, ‘asm’ or ‘__attribute__’ before ‘*’ token
/tmp/vbox.4/include/iprt/types.h:541: error: expected ‘=’, ‘,’, ‘;’, ‘asm’ or ‘__attribute__’ before ‘*’ token
/tmp/vbox.4/include/iprt/types.h:546: error: expected ‘=’, ‘,’, ‘;’, ‘asm’ or ‘__attribute__’ before ‘RTHCUINTPTR’
/tmp/vbox.4/include/iprt/types.h:553: error: expected ‘=’, ‘,’, ‘;’, ‘asm’ or ‘__attribute__’ before ‘*’ token
/tmp/vbox.4/include/iprt/types.h:555: error: expected ‘=’, ‘,’, ‘;’, ‘asm’ or ‘__attribute__’ before ‘*’ token
/tmp/vbox.4/include/iprt/types.h:559: error: expected ‘=’, ‘,’, ‘;’, ‘asm’ or ‘__attribute__’ before ‘RTR3UINTPTR’
/tmp/vbox.4/include/iprt/types.h:566: error: expected ‘=’, ‘,’, ‘;’, ‘asm’ or ‘__attribute__’ before ‘*’ token
/tmp/vbox.4/include/iprt/types.h:568: error: expected ‘=’, ‘,’, ‘;’, ‘asm’ or ‘__attribute__’ before ‘*’ token
/tmp/vbox.4/include/iprt/types.h:572: error: expected ‘=’, ‘,’, ‘;’, ‘asm’ or ‘__attribute__’ before ‘RTR0UINTPTR’
/tmp/vbox.4/include/iprt/types.h:579: error: expected ‘=’, ‘,’, ‘;’, ‘asm’ or ‘__attribute__’ before ‘*’ token
/tmp/vbox.4/include/iprt/types.h:581: error: expected ‘=’, ‘,’, ‘;’, ‘asm’ or ‘__attribute__’ before ‘*’ token
/tmp/vbox.4/include/iprt/types.h:587: error: expected ‘=’, ‘,’, ‘;’, ‘asm’ or ‘__attribute__’ before ‘RTHCPHYS’
/tmp/vbox.4/include/iprt/types.h:589: error: expected ‘=’, ‘,’, ‘;’, ‘asm’ or ‘__attribute__’ before ‘*’ token
/tmp/vbox.4/include/iprt/types.h:591: error: expected ‘=’, ‘,’, ‘;’, ‘asm’ or ‘__attribute__’ before ‘*’ token
/tmp/vbox.4/include/iprt/types.h:619: error: expected ‘=’, ‘,’, ‘;’, ‘asm’ or ‘__attribute__’ before ‘RTR3PTR’
/tmp/vbox.4/include/iprt/types.h:622: error: expected ‘=’, ‘,’, ‘;’, ‘asm’ or ‘__attribute__’ before ‘*’ token
/tmp/vbox.4/include/iprt/types.h:624: error: expected ‘=’, ‘,’, ‘;’, ‘asm’ or ‘__attribute__’ before ‘*’ token
/tmp/vbox.4/include/iprt/types.h:648: error: expected ‘=’, ‘,’, ‘;’, ‘asm’ or ‘__attribute__’ before ‘RTHCUINTREG’
/tmp/vbox.4/include/iprt/types.h:655: error: expected ‘=’, ‘,’, ‘;’, ‘asm’ or ‘__attribute__’ before ‘*’ token
/tmp/vbox.4/include/iprt/types.h:657: error: expected ‘=’, ‘,’, ‘;’, ‘asm’ or ‘__attribute__’ before ‘*’ token
/tmp/vbox.4/include/iprt/types.h:661: error: expected ‘=’, ‘,’, ‘;’, ‘asm’ or ‘__attribute__’ before ‘RTR3UINTREG’
/tmp/vbox.4/include/iprt/types.h:668: error: expected ‘=’, ‘,’, ‘;’, ‘asm’ or ‘__attribute__’ before ‘*’ token
/tmp/vbox.4/include/iprt/types.h:670: error: expected ‘=’, ‘,’, ‘;’, ‘asm’ or ‘__attribute__’ before ‘*’ token
/tmp/vbox.4/include/iprt/types.h:674: error: expected ‘=’, ‘,’, ‘;’, ‘asm’ or ‘__attribute__’ before ‘RTR0UINTREG’
/tmp/vbox.4/include/iprt/types.h:681: error: expected ‘=’, ‘,’, ‘;’, ‘asm’ or ‘__attribute__’ before ‘*’ token
/tmp/vbox.4/include/iprt/types.h:683: error: expected ‘=’, ‘,’, ‘;’, ‘asm’ or ‘__attribute__’ before ‘*’ token
/tmp/vbox.4/include/iprt/types.h:694: error: expected ‘=’, ‘,’, ‘;’, ‘asm’ or ‘__attribute__’ before ‘RTGCINT’
/tmp/vbox.4/include/iprt/types.h:696: error: expected ‘=’, ‘,’, ‘;’, ‘asm’ or ‘__attribute__’ before ‘*’ token
/tmp/vbox.4/include/iprt/types.h:698: error: expected ‘=’, ‘,’, ‘;’, ‘asm’ or ‘__attribute__’ before ‘*’ token
/tmp/vbox.4/include/iprt/types.h:701: error: expected ‘=’, ‘,’, ‘;’, ‘asm’ or ‘__attribute__’ before ‘RTGCUINT’
/tmp/vbox.4/include/iprt/types.h:703: error: expected ‘=’, ‘,’, ‘;’, ‘asm’ or ‘__attribute__’ before ‘*’ token
/tmp/vbox.4/include/iprt/types.h:705: error: expected ‘=’, ‘,’, ‘;’, ‘asm’ or ‘__attribute__’ before ‘*’ token
/tmp/vbox.4/include/iprt/types.h:709: error: expected ‘=’, ‘,’, ‘;’, ‘asm’ or ‘__attribute__’ before ‘RTGCINTPTR’
/tmp/vbox.4/include/iprt/types.h:716: error: expected ‘=’, ‘,’, ‘;’, ‘asm’ or ‘__attribute__’ before ‘*’ token
/tmp/vbox.4/include/iprt/types.h:718: error: expected ‘=’, ‘,’, ‘;’, ‘asm’ or ‘__attribute__’ before ‘*’ token
/tmp/vbox.4/include/iprt/types.h:722: error: expected ‘=’, ‘,’, ‘;’, ‘asm’ or ‘__attribute__’ before ‘RTGCUINTPTR’
/tmp/vbox.4/include/iprt/types.h:729: error: expected ‘=’, ‘,’, ‘;’, ‘asm’ or ‘__attribute__’ before ‘*’ token
/tmp/vbox.4/include/iprt/types.h:731: error: expected ‘=’, ‘,’, ‘;’, ‘asm’ or ‘__attribute__’ before ‘*’ token
/tmp/vbox.4/include/iprt/types.h:734: error: expected ‘=’, ‘,’, ‘;’, ‘asm’ or ‘__attribute__’ before ‘RTGCPHYS’
/tmp/vbox.4/include/iprt/types.h:736: error: expected ‘=’, ‘,’, ‘;’, ‘asm’ or ‘__attribute__’ before ‘*’ token
/tmp/vbox.4/include/iprt/types.h:738: error: expected ‘=’, ‘,’, ‘;’, ‘asm’ or ‘__attribute__’ before ‘*’ token
/tmp/vbox.4/include/iprt/types.h:754: error: expected ‘=’, ‘,’, ‘;’, ‘asm’ or ‘__attribute__’ before ‘RTGCPTR’
/tmp/vbox.4/include/iprt/types.h:757: error: expected ‘=’, ‘,’, ‘;’, ‘asm’ or ‘__attribute__’ before ‘*’ token
/tmp/vbox.4/include/iprt/types.h:759: error: expected ‘=’, ‘,’, ‘;’, ‘asm’ or ‘__attribute__’ before ‘*’ token
/tmp/vbox.4/include/iprt/types.h:768: error: expected ‘=’, ‘,’, ‘;’, ‘asm’ or ‘__attribute__’ before ‘RTGCUINTREG’
/tmp/vbox.4/include/iprt/types.h:775: error: expected ‘=’, ‘,’, ‘;’, ‘asm’ or ‘__attribute__’ before ‘*’ token
/tmp/vbox.4/include/iprt/types.h:777: error: expected ‘=’, ‘,’, ‘;’, ‘asm’ or ‘__attribute__’ before ‘*’ token
/tmp/vbox.4/include/iprt/types.h:791: error: expected ‘=’, ‘,’, ‘;’, ‘asm’ or ‘__attribute__’ before ‘RTCCPHYS’
/tmp/vbox.4/include/iprt/types.h:794: error: expected ‘=’, ‘,’, ‘;’, ‘asm’ or ‘__attribute__’ before ‘*’ token
/tmp/vbox.4/include/iprt/types.h:796: error: expected ‘=’, ‘,’, ‘;’, ‘asm’ or ‘__attribute__’ before ‘*’ token
/tmp/vbox.4/include/iprt/types.h:810: error: expected ‘=’, ‘,’, ‘;’, ‘asm’ or ‘__attribute__’ before ‘RTCCUINTREG’
/tmp/vbox.4/include/iprt/types.h:817: error: expected ‘=’, ‘,’, ‘;’, ‘asm’ or ‘__attribute__’ before ‘*’ token
/tmp/vbox.4/include/iprt/types.h:819: error: expected ‘=’, ‘,’, ‘;’, ‘asm’ or ‘__attribute__’ before ‘*’ token
/tmp/vbox.4/include/iprt/types.h:822: error: expected ‘=’, ‘,’, ‘;’, ‘asm’ or ‘__attribute__’ before ‘RTUINTREG’
/tmp/vbox.4/include/iprt/types.h:824: error: expected ‘=’, ‘,’, ‘;’, ‘asm’ or ‘__attribute__’ before ‘*’ token
/tmp/vbox.4/include/iprt/types.h:826: error: expected ‘=’, ‘,’, ‘;’, ‘asm’ or ‘__attribute__’ before ‘*’ token
/tmp/vbox.4/include/iprt/types.h:832: error: expected ‘=’, ‘,’, ‘;’, ‘asm’ or ‘__attribute__’ before ‘RTFILE’
/tmp/vbox.4/include/iprt/types.h:834: error: expected ‘=’, ‘,’, ‘;’, ‘asm’ or ‘__attribute__’ before ‘*’ token
/tmp/vbox.4/include/iprt/types.h:853: error: expected ‘=’, ‘,’, ‘;’, ‘asm’ or ‘__attribute__’ before ‘RTNATIVETHREAD’
/tmp/vbox.4/include/iprt/types.h:855: error: expected ‘=’, ‘,’, ‘;’, ‘asm’ or ‘__attribute__’ before ‘*’ token
/tmp/vbox.4/include/iprt/types.h:860: error: expected ‘=’, ‘,’, ‘;’, ‘asm’ or ‘__attribute__’ before ‘RTPROCESS’
/tmp/vbox.4/include/iprt/types.h:862: error: expected ‘=’, ‘,’, ‘;’, ‘asm’ or ‘__attribute__’ before ‘*’ token
/tmp/vbox.4/include/iprt/types.h:867: error: expected ‘=’, ‘,’, ‘;’, ‘asm’ or ‘__attribute__’ before ‘RTR0PROCESS’
/tmp/vbox.4/include/iprt/types.h:869: error: expected ‘=’, ‘,’, ‘;’, ‘asm’ or ‘__attribute__’ before ‘*’ token
/tmp/vbox.4/include/iprt/types.h:955: error: expected specifier-qualifier-list before ‘uint8_t’
/tmp/vbox.4/include/iprt/types.h:995: error: expected ‘=’, ‘,’, ‘;’, ‘asm’ or ‘__attribute__’ before ‘RTUNICP’
/tmp/vbox.4/include/iprt/types.h:997: error: expected ‘=’, ‘,’, ‘;’, ‘asm’ or ‘__attribute__’ before ‘*’ token
/tmp/vbox.4/include/iprt/types.h:999: error: expected ‘=’, ‘,’, ‘;’, ‘asm’ or ‘__attribute__’ before ‘*’ token
/tmp/vbox.4/include/iprt/types.h:1010: error: expected ‘=’, ‘,’, ‘;’, ‘asm’ or ‘__attribute__’ before ‘RTUTF16’
/tmp/vbox.4/include/iprt/types.h:1012: error: expected ‘=’, ‘,’, ‘;’, ‘asm’ or ‘__attribute__’ before ‘*’ token
/tmp/vbox.4/include/iprt/types.h:1014: error: expected ‘=’, ‘,’, ‘;’, ‘asm’ or ‘__attribute__’ before ‘*’ token
/tmp/vbox.4/include/iprt/types.h:1021: error: expected ‘=’, ‘,’, ‘;’, ‘asm’ or ‘__attribute__’ before ‘RTUCS2’
/tmp/vbox.4/include/iprt/types.h:1025: error: expected ‘=’, ‘,’, ‘;’, ‘asm’ or ‘__attribute__’ before ‘PRTUCS2’
/tmp/vbox.4/include/iprt/types.h:1029: error: expected ‘=’, ‘,’, ‘;’, ‘asm’ or ‘__attribute__’ before ‘PCRTUCS2’
/tmp/vbox.4/include/iprt/types.h:1057: error: expected specifier-qualifier-list before ‘int32_t’
In file included from /tmp/vbox.4/SUPDRV.h:26,
from /tmp/vbox.4/linux/SUPDrv-linux.c:22:
/tmp/vbox.4/include/VBox/types.h:42: error: expected ‘=’, ‘,’, ‘;’, ‘asm’ or ‘__attribute__’ before ‘VBOXHCPHYS’
/tmp/vbox.4/include/VBox/types.h:43: error: expected ‘=’, ‘,’, ‘;’, ‘asm’ or ‘__attribute__’ before ‘*’ token
/tmp/vbox.4/include/VBox/types.h:59: error: expected ‘=’, ‘,’, ‘;’, ‘asm’ or ‘__attribute__’ before ‘VBOXGCPHYS’
/tmp/vbox.4/include/VBox/types.h:60: error: expected ‘=’, ‘,’, ‘;’, ‘asm’ or ‘__attribute__’ before ‘*’ token
/tmp/vbox.4/include/VBox/types.h:62: error: expected ‘=’, ‘,’, ‘;’, ‘asm’ or ‘__attribute__’ before ‘VBOXGCPTR’
/tmp/vbox.4/include/VBox/types.h:63: error: expected ‘=’, ‘,’, ‘;’, ‘asm’ or ‘__attribute__’ before ‘*’ token
/tmp/vbox.4/include/VBox/types.h:79: error: expected ‘=’, ‘,’, ‘;’, ‘asm’ or ‘__attribute__’ before ‘PVMR3’
/tmp/vbox.4/include/VBox/types.h:81: error: expected ‘=’, ‘,’, ‘;’, ‘asm’ or ‘__attribute__’ before ‘PVMGC’
/tmp/vbox.4/include/VBox/types.h:130: error: expected ‘=’, ‘,’, ‘;’, ‘asm’ or ‘__attribute__’ before ‘PPDMDEVINSR3’
/tmp/vbox.4/include/VBox/types.h:134: error: expected ‘=’, ‘,’, ‘;’, ‘asm’ or ‘__attribute__’ before ‘PPDMDEVINSGC’
/tmp/vbox.4/include/VBox/types.h:159: error: expected ‘=’, ‘,’, ‘;’, ‘asm’ or ‘__attribute__’ before ‘PTMTIMERR3’
/tmp/vbox.4/include/VBox/types.h:161: error: expected ‘=’, ‘,’, ‘;’, ‘asm’ or ‘__attribute__’ before ‘*’ token
/tmp/vbox.4/include/VBox/types.h:169: error: expected ‘=’, ‘,’, ‘;’, ‘asm’ or ‘__attribute__’ before ‘PTMTIMERGC’
/tmp/vbox.4/include/VBox/types.h:171: error: expected ‘=’, ‘,’, ‘;’, ‘asm’ or ‘__attribute__’ before ‘*’ token
/tmp/vbox.4/include/VBox/types.h:349: error: expected specifier-qualifier-list before ‘uint8_t’
/tmp/vbox.4/include/VBox/types.h:366: error: expected specifier-qualifier-list before ‘uint16_t’
/tmp/vbox.4/include/VBox/types.h:430: error: expected specifier-qualifier-list before ‘uint8_t’
/tmp/vbox.4/include/VBox/types.h:448: error: expected specifier-qualifier-list before ‘uint16_t’
/tmp/vbox.4/include/VBox/types.h:485: error: expected specifier-qualifier-list before ‘RTSEL’
In file included from /tmp/vbox.4/SUPDRV.h:28,
from /tmp/vbox.4/linux/SUPDrv-linux.c:22:
/tmp/vbox.4/include/iprt/asm.h:123: error: expected specifier-qualifier-list before ‘uint16_t’
/tmp/vbox.4/include/iprt/asm.h:134: error: expected specifier-qualifier-list before ‘uint16_t’
/tmp/vbox.4/include/iprt/asm.h:245: error: expected ‘=’, ‘,’, ‘;’, ‘asm’ or ‘__attribute__’ before ‘ASMGetCS’
/tmp/vbox.4/include/iprt/asm.h:269: error: expected ‘=’, ‘,’, ‘;’, ‘asm’ or ‘__attribute__’ before ‘ASMGetDS’
/tmp/vbox.4/include/iprt/asm.h:293: error: expected ‘=’, ‘,’, ‘;’, ‘asm’ or ‘__attribute__’ before ‘ASMGetES’
/tmp/vbox.4/include/iprt/asm.h:317: error: expected ‘=’, ‘,’, ‘;’, ‘asm’ or ‘__attribute__’ before ‘ASMGetFS’
/tmp/vbox.4/include/iprt/asm.h:341: error: expected ‘=’, ‘,’, ‘;’, ‘asm’ or ‘__attribute__’ before ‘ASMGetGS’
/tmp/vbox.4/include/iprt/asm.h:365: error: expected ‘=’, ‘,’, ‘;’, ‘asm’ or ‘__attribute__’ before ‘ASMGetSS’
/tmp/vbox.4/include/iprt/asm.h:389: error: expected ‘=’, ‘,’, ‘;’, ‘asm’ or ‘__attribute__’ before ‘ASMGetTR’
/tmp/vbox.4/include/iprt/asm.h:413: error: expected ‘=’, ‘,’, ‘;’, ‘asm’ or ‘__attribute__’ before ‘ASMGetFlags’
/tmp/vbox.4/include/iprt/asm.h:450: error: expected ‘)’ before ‘uFlags’
/tmp/vbox.4/include/iprt/asm.h:486: error: expected ‘=’, ‘,’, ‘;’, ‘asm’ or ‘__attribute__’ before ‘ASMReadTSC’
/tmp/vbox.4/include/iprt/asm.h:521: error: expected ‘)’ before ‘uOperator’
/tmp/vbox.4/include/iprt/asm.h:593: error: expected ‘)’ before ‘uOperator’
/tmp/vbox.4/include/iprt/asm.h:667: error: expected ‘)’ before ‘uOperator’
/tmp/vbox.4/include/iprt/asm.h:684: error: expected ‘=’, ‘,’, ‘;’, ‘asm’ or ‘__attribute__’ before ‘ASMCpuId_EDX’
/tmp/vbox.4/include/iprt/asm.h:740: error: expected ‘=’, ‘,’, ‘;’, ‘asm’ or ‘__attribute__’ before ‘ASMCpuId_ECX’
/tmp/vbox.4/include/iprt/asm.h: In function ‘ASMHasCpuId’:
/tmp/vbox.4/include/iprt/asm.h:800: error: ‘uint32_t’ undeclared (first use in this function)
/tmp/vbox.4/include/iprt/asm.h:800: error: (Each undeclared identifier is reported only once
/tmp/vbox.4/include/iprt/asm.h:800: error: for each function it appears in.)
/tmp/vbox.4/include/iprt/asm.h:800: error: expected ‘;’ before ‘u1’
/tmp/vbox.4/include/iprt/asm.h:801: error: expected ‘;’ before ‘u2’
/tmp/vbox.4/include/iprt/asm.h:814: error: ‘u1’ undeclared (first use in this function)
/tmp/vbox.4/include/iprt/asm.h:814: error: ‘u2’ undeclared (first use in this function)
/tmp/vbox.4/include/iprt/asm.h:802: error: invalid lvalue in asm output 1
/tmp/vbox.4/include/iprt/asm.h:802: error: invalid lvalue in asm output 2
/tmp/vbox.4/include/iprt/asm.h: At top level:
/tmp/vbox.4/include/iprt/asm.h:845: error: expected ‘=’, ‘,’, ‘;’, ‘asm’ or ‘__attribute__’ before ‘ASMGetApicId’
/tmp/vbox.4/include/iprt/asm.h:900: error: expected ‘=’, ‘,’, ‘;’, ‘asm’ or ‘__attribute__’ before ‘ASMGetCR0’
/tmp/vbox.4/include/iprt/asm.h:936: error: expected ‘)’ before ‘uCR0’
/tmp/vbox.4/include/iprt/asm.h:970: error: expected ‘=’, ‘,’, ‘;’, ‘asm’ or ‘__attribute__’ before ‘ASMGetCR2’
/tmp/vbox.4/include/iprt/asm.h:1006: error: expected ‘)’ before ‘uCR2’
/tmp/vbox.4/include/iprt/asm.h:1037: error: expected ‘=’, ‘,’, ‘;’, ‘asm’ or ‘__attribute__’ before ‘ASMGetCR3’
/tmp/vbox.4/include/iprt/asm.h:1074: error: expected ‘)’ before ‘uCR3’
/tmp/vbox.4/include/iprt/asm.h: In function ‘ASMReloadCR3’:
/tmp/vbox.4/include/iprt/asm.h:1113: error: ‘RTCCUINTREG’ undeclared (first use in this function)
/tmp/vbox.4/include/iprt/asm.h:1113: error: expected ‘;’ before ‘u’
/tmp/vbox.4/include/iprt/asm.h:1121: error: ‘u’ undeclared (first use in this function)
/tmp/vbox.4/include/iprt/asm.h:1119: error: invalid lvalue in asm output 0
/tmp/vbox.4/include/iprt/asm.h: At top level:
/tmp/vbox.4/include/iprt/asm.h:1146: error: expected ‘=’, ‘,’, ‘;’, ‘asm’ or ‘__attribute__’ before ‘ASMGetCR4’
/tmp/vbox.4/include/iprt/asm.h:1188: error: expected ‘)’ before ‘uCR4’
/tmp/vbox.4/include/iprt/asm.h:1225: error: expected ‘=’, ‘,’, ‘;’, ‘asm’ or ‘__attribute__’ before ‘ASMGetCR8’
/tmp/vbox.4/include/iprt/asm.h:1293: error: expected ‘=’, ‘,’, ‘;’, ‘asm’ or ‘__attribute__’ before ‘ASMIntDisableFlags’
/tmp/vbox.4/include/iprt/asm.h:1332: error: expected ‘=’, ‘,’, ‘;’, ‘asm’ or ‘__attribute__’ before ‘ASMRdMsr’
/tmp/vbox.4/include/iprt/asm.h:1369: error: expected ‘)’ before ‘uRegister’
/tmp/vbox.4/include/iprt/asm.h:1405: error: expected ‘=’, ‘,’, ‘;’, ‘asm’ or ‘__attribute__’ before ‘ASMRdMsr_Low’
/tmp/vbox.4/include/iprt/asm.h:1440: error: expected ‘=’, ‘,’, ‘;’, ‘asm’ or ‘__attribute__’ before ‘ASMRdMsr_High’
/tmp/vbox.4/include/iprt/asm.h:1474: error: expected ‘=’, ‘,’, ‘;’, ‘asm’ or ‘__attribute__’ before ‘ASMGetDR7’
/tmp/vbox.4/include/iprt/asm.h:1508: error: expected ‘=’, ‘,’, ‘;’, ‘asm’ or ‘__attribute__’ before ‘ASMGetDR6’
/tmp/vbox.4/include/iprt/asm.h:1542: error: expected ‘=’, ‘,’, ‘;’, ‘asm’ or ‘__attribute__’ before ‘ASMGetAndClearDR6’
/tmp/vbox.4/include/iprt/asm.h:1613: error: expected ‘)’ before ‘Port’
/tmp/vbox.4/include/iprt/asm.h:1644: error: expected ‘=’, ‘,’, ‘;’, ‘asm’ or ‘__attribute__’ before ‘ASMInU8’
/tmp/vbox.4/include/iprt/asm.h:1677: error: expected ‘)’ before ‘Port’
/tmp/vbox.4/include/iprt/asm.h:1708: error: expected ‘=’, ‘,’, ‘;’, ‘asm’ or ‘__attribute__’ before ‘ASMInU16’
/tmp/vbox.4/include/iprt/asm.h:1741: error: expected ‘)’ before ‘Port’
/tmp/vbox.4/include/iprt/asm.h:1772: error: expected ‘=’, ‘,’, ‘;’, ‘asm’ or ‘__attribute__’ before ‘ASMInU32’
/tmp/vbox.4/include/iprt/asm.h:1806: error: expected ‘=’, ‘,’, ‘;’, ‘asm’ or ‘__attribute__’ before ‘ASMAtomicXchgU8’
/tmp/vbox.4/include/iprt/asm.h:1841: error: expected ‘=’, ‘,’, ‘;’, ‘asm’ or ‘__attribute__’ before ‘ASMAtomicXchgS8’
/tmp/vbox.4/include/iprt/asm.h: In function ‘ASMAtomicXchgBool’:
/tmp/vbox.4/include/iprt/asm.h:1859: warning: implicit declaration of function ‘ASMAtomicXchgU8’
/tmp/vbox.4/include/iprt/asm.h:1859: error: expected ‘)’ before ‘uint8_t’
/tmp/vbox.4/include/iprt/asm.h:1859: warning: type defaults to ‘int’ in declaration of ‘type name’
/tmp/vbox.4/include/iprt/asm.h:1859: error: ‘uint8_t’ undeclared (first use in this function)
/tmp/vbox.4/include/iprt/asm.h:1859: error: expected ‘)’ before ‘f’
/tmp/vbox.4/include/iprt/asm.h: At top level:
/tmp/vbox.4/include/iprt/asm.h:1874: error: expected ‘=’, ‘,’, ‘;’, ‘asm’ or ‘__attribute__’ before ‘ASMAtomicXchgU16’
/tmp/vbox.4/include/iprt/asm.h:1909: error: expected ‘=’, ‘,’, ‘;’, ‘asm’ or ‘__attribute__’ before ‘ASMAtomicXchgS16’
/tmp/vbox.4/include/iprt/asm.h:1925: error: expected ‘=’, ‘,’, ‘;’, ‘asm’ or ‘__attribute__’ before ‘ASMAtomicXchgU32’
/tmp/vbox.4/include/iprt/asm.h:1964: error: expected ‘=’, ‘,’, ‘;’, ‘asm’ or ‘__attribute__’ before ‘ASMAtomicXchgS32’
/tmp/vbox.4/include/iprt/asm.h:1980: error: expected ‘=’, ‘,’, ‘;’, ‘asm’ or ‘__attribute__’ before ‘ASMAtomicXchgU64’
/tmp/vbox.4/include/iprt/asm.h:2055: error: expected ‘=’, ‘,’, ‘;’, ‘asm’ or ‘__attribute__’ before ‘ASMAtomicXchgS64’
/tmp/vbox.4/include/iprt/asm.h:2133: error: expected ‘=’, ‘,’, ‘;’, ‘asm’ or ‘__attribute__’ before ‘ASMAtomicReadU64’
/tmp/vbox.4/include/iprt/asm.h:2197: error: expected ‘=’, ‘,’, ‘;’, ‘asm’ or ‘__attribute__’ before ‘ASMAtomicReadS64’
/tmp/vbox.4/include/iprt/asm.h: In function ‘ASMAtomicXchgPtr’:
/tmp/vbox.4/include/iprt/asm.h:2232: warning: implicit declaration of function ‘ASMAtomicXchgU32’
/tmp/vbox.4/include/iprt/asm.h:2232: error: expected ‘)’ before ‘uint32_t’
/tmp/vbox.4/include/iprt/asm.h:2232: warning: type defaults to ‘int’ in declaration of ‘type name’
/tmp/vbox.4/include/iprt/asm.h:2232: error: ‘uint32_t’ undeclared (first use in this function)
/tmp/vbox.4/include/iprt/asm.h:2232: error: expected ‘)’ before ‘pv’
/tmp/vbox.4/include/iprt/asm.h: At top level:
/tmp/vbox.4/include/iprt/asm.h:2254: warning: type defaults to ‘int’ in declaration of ‘uint32_t’
/tmp/vbox.4/include/iprt/asm.h:2254: error: expected ‘;’, ‘,’ or ‘)’ before ‘*’ token
/tmp/vbox.4/include/iprt/asm.h:2306: warning: type defaults to ‘int’ in declaration of ‘int32_t’
/tmp/vbox.4/include/iprt/asm.h:2306: error: expected ‘;’, ‘,’ or ‘)’ before ‘*’ token
/tmp/vbox.4/include/iprt/asm.h:2325: warning: type defaults to ‘int’ in declaration of ‘uint64_t’
/tmp/vbox.4/include/iprt/asm.h:2325: error: expected ‘;’, ‘,’ or ‘)’ before ‘*’ token
/tmp/vbox.4/include/iprt/asm.h:2415: warning: type defaults to ‘int’ in declaration of ‘int64_t’
/tmp/vbox.4/include/iprt/asm.h:2415: error: expected ‘;’, ‘,’ or ‘)’ before ‘*’ token
/tmp/vbox.4/include/iprt/asm.h: In function ‘ASMAtomicCmpXchgPtr’:
/tmp/vbox.4/include/iprt/asm.h:2458: warning: implicit declaration of function ‘ASMAtomicCmpXchgU32’
/tmp/vbox.4/include/iprt/asm.h:2458: error: expected ‘)’ before ‘uint32_t’
/tmp/vbox.4/include/iprt/asm.h:2458: warning: type defaults to ‘int’ in declaration of ‘type name’
/tmp/vbox.4/include/iprt/asm.h:2458: error: ‘uint32_t’ undeclared (first use in this function)
/tmp/vbox.4/include/iprt/asm.h:2458: error: expected ‘)’ before ‘pvNew’
/tmp/vbox.4/include/iprt/asm.h: At top level:
/tmp/vbox.4/include/iprt/asm.h:2476: error: expected ‘=’, ‘,’, ‘;’, ‘asm’ or ‘__attribute__’ before ‘ASMAtomicIncU32’
/tmp/vbox.4/include/iprt/asm.h:2515: error: expected ‘=’, ‘,’, ‘;’, ‘asm’ or ‘__attribute__’ before ‘ASMAtomicIncS32’
/tmp/vbox.4/include/iprt/asm.h:2530: error: expected ‘=’, ‘,’, ‘;’, ‘asm’ or ‘__attribute__’ before ‘ASMAtomicDecU32’
/tmp/vbox.4/include/iprt/asm.h:2569: error: expected ‘=’, ‘,’, ‘;’, ‘asm’ or ‘__attribute__’ before ‘ASMAtomicDecS32’
/tmp/vbox.4/include/iprt/asm.h:2584: error: expected ‘)’ before ‘volatile’
/tmp/vbox.4/include/iprt/asm.h:2616: error: expected ‘)’ before ‘volatile’
/tmp/vbox.4/include/iprt/asm.h:2631: error: expected ‘)’ before ‘volatile’
/tmp/vbox.4/include/iprt/asm.h:2663: error: expected ‘)’ before ‘volatile’
/tmp/vbox.4/include/iprt/asm.h: In function ‘ASMInvalidatePage’:
/tmp/vbox.4/include/iprt/asm.h:2684: error: ‘uint8_t’ undeclared (first use in this function)
/tmp/vbox.4/include/iprt/asm.h:2684: error: expected expression before ‘)’ token
/tmp/vbox.4/include/iprt/asm.h: In function ‘ASMMemZeroPage’:
/tmp/vbox.4/include/iprt/asm.h:2725: error: ‘RTUINTREG’ undeclared (first use in this function)
/tmp/vbox.4/include/iprt/asm.h:2725: error: expected ‘;’ before ‘uDummy’
/tmp/vbox.4/include/iprt/asm.h:2737: error: ‘uDummy’ undeclared (first use in this function)
/tmp/vbox.4/include/iprt/asm.h:2735: error: invalid lvalue in asm output 1
/tmp/vbox.4/include/iprt/asm.h: At top level:
/tmp/vbox.4/include/iprt/asm.h:2815: error: expected declaration specifiers or ‘...’ before ‘uint32_t’
/tmp/vbox.4/include/iprt/asm.h: In function ‘ASMMemFill32’:
/tmp/vbox.4/include/iprt/asm.h:2826: error: ‘u32’ undeclared (first use in this function)
/tmp/vbox.4/include/iprt/asm.h: At top level:
/tmp/vbox.4/include/iprt/asm.h:2857: error: expected ‘=’, ‘,’, ‘;’, ‘asm’ or ‘__attribute__’ before ‘ASMMult2xU32RetU64’
/tmp/vbox.4/include/iprt/asm.h:2891: error: expected ‘=’, ‘,’, ‘;’, ‘asm’ or ‘__attribute__’ before ‘ASMMult2xS32RetS64’
/tmp/vbox.4/include/iprt/asm.h:2925: error: expected ‘=’, ‘,’, ‘;’, ‘asm’ or ‘__attribute__’ before ‘ASMDivU64ByU32RetU32’
/tmp/vbox.4/include/iprt/asm.h:2959: error: expected ‘=’, ‘,’, ‘;’, ‘asm’ or ‘__attribute__’ before ‘ASMDivS64ByS32RetS32’
/tmp/vbox.4/include/iprt/asm.h:2999: error: expected ‘=’, ‘,’, ‘;’, ‘asm’ or ‘__attribute__’ before ‘ASMMultU64ByU32DivByU32’
/tmp/vbox.4/include/iprt/asm.h:3070: error: expected ‘=’, ‘,’, ‘;’, ‘asm’ or ‘__attribute__’ before ‘ASMProbeReadByte’
/tmp/vbox.4/include/iprt/asm.h: In function ‘ASMProbeReadBuffer’:
/tmp/vbox.4/include/iprt/asm.h:3112: error: expected ‘=’, ‘,’, ‘;’, ‘asm’ or ‘__attribute__’ before ‘*’ token
/tmp/vbox.4/include/iprt/asm.h:3112: error: ‘pu8’ undeclared (first use in this function)
/tmp/vbox.4/include/iprt/asm.h:3112: error: expected ‘)’ before ‘uint8_t’
/tmp/vbox.4/include/iprt/asm.h:3112: warning: type defaults to ‘int’ in declaration of ‘type name’
/tmp/vbox.4/include/iprt/asm.h:3113: warning: implicit declaration of function ‘ASMProbeReadByte’
/tmp/vbox.4/include/iprt/asm.h: At top level:
/tmp/vbox.4/include/iprt/asm.h:3161: error: expected declaration specifiers or ‘...’ before ‘int32_t’
/tmp/vbox.4/include/iprt/asm.h: In function ‘ASMBitSet’:
/tmp/vbox.4/include/iprt/asm.h:3169: error: ‘iBit’ undeclared (first use in this function)
/tmp/vbox.4/include/iprt/asm.h: At top level:
/tmp/vbox.4/include/iprt/asm.h:3198: error: expected declaration specifiers or ‘...’ before ‘int32_t’
/tmp/vbox.4/include/iprt/asm.h: In function ‘ASMAtomicBitSet’:
/tmp/vbox.4/include/iprt/asm.h:3205: error: ‘iBit’ undeclared (first use in this function)
/tmp/vbox.4/include/iprt/asm.h: At top level:
/tmp/vbox.4/include/iprt/asm.h:3234: error: expected declaration specifiers or ‘...’ before ‘int32_t’
/tmp/vbox.4/include/iprt/asm.h: In function ‘ASMBitClear’:
/tmp/vbox.4/include/iprt/asm.h:3242: error: ‘iBit’ undeclared (first use in this function)
/tmp/vbox.4/include/iprt/asm.h: At top level:
/tmp/vbox.4/include/iprt/asm.h:3272: error: expected declaration specifiers or ‘...’ before ‘int32_t’
/tmp/vbox.4/include/iprt/asm.h: In function ‘ASMAtomicBitClear’:
/tmp/vbox.4/include/iprt/asm.h:3277: error: ‘iBit’ undeclared (first use in this function)
/tmp/vbox.4/include/iprt/asm.h: At top level:
/tmp/vbox.4/include/iprt/asm.h:3306: error: expected declaration specifiers or ‘...’ before ‘int32_t’
/tmp/vbox.4/include/iprt/asm.h: In function ‘ASMBitToggle’:
/tmp/vbox.4/include/iprt/asm.h:3313: error: ‘iBit’ undeclared (first use in this function)
/tmp/vbox.4/include/iprt/asm.h: At top level:
/tmp/vbox.4/include/iprt/asm.h:3342: error: expected declaration specifiers or ‘...’ before ‘int32_t’
/tmp/vbox.4/include/iprt/asm.h: In function ‘ASMAtomicBitToggle’:
/tmp/vbox.4/include/iprt/asm.h:3347: error: ‘iBit’ undeclared (first use in this function)
/tmp/vbox.4/include/iprt/asm.h: At top level:
/tmp/vbox.4/include/iprt/asm.h:3378: error: expected declaration specifiers or ‘...’ before ‘int32_t’
/tmp/vbox.4/include/iprt/asm.h: In function ‘ASMBitTestAndSet’:
/tmp/vbox.4/include/iprt/asm.h:3380: error: expected specifier-qualifier-list before ‘uint32_t’
/tmp/vbox.4/include/iprt/asm.h:3388: error: ‘union <anonymous>’ has no member named ‘u32’
/tmp/vbox.4/include/iprt/asm.h:3390: error: ‘iBit’ undeclared (first use in this function)
/tmp/vbox.4/include/iprt/asm.h:3385: error: invalid lvalue in asm output 0
/tmp/vbox.4/include/iprt/asm.h: At top level:
/tmp/vbox.4/include/iprt/asm.h:3424: error: expected declaration specifiers or ‘...’ before ‘int32_t’
/tmp/vbox.4/include/iprt/asm.h: In function ‘ASMAtomicBitTestAndSet’:
/tmp/vbox.4/include/iprt/asm.h:3426: error: expected specifier-qualifier-list before ‘uint32_t’
/tmp/vbox.4/include/iprt/asm.h:3433: error: ‘union <anonymous>’ has no member named ‘u32’
/tmp/vbox.4/include/iprt/asm.h:3435: error: ‘iBit’ undeclared (first use in this function)
/tmp/vbox.4/include/iprt/asm.h:3430: error: invalid lvalue in asm output 0
/tmp/vbox.4/include/iprt/asm.h: At top level:
/tmp/vbox.4/include/iprt/asm.h:3469: error: expected declaration specifiers or ‘...’ before ‘int32_t’
/tmp/vbox.4/include/iprt/asm.h: In function ‘ASMBitTestAndClear’:
/tmp/vbox.4/include/iprt/asm.h:3471: error: expected specifier-qualifier-list before ‘uint32_t’
/tmp/vbox.4/include/iprt/asm.h:3479: error: ‘union <anonymous>’ has no member named ‘u32’
/tmp/vbox.4/include/iprt/asm.h:3481: error: ‘iBit’ undeclared (first use in this function)
/tmp/vbox.4/include/iprt/asm.h:3476: error: invalid lvalue in asm output 0
/tmp/vbox.4/include/iprt/asm.h: At top level:
/tmp/vbox.4/include/iprt/asm.h:3516: error: expected declaration specifiers or ‘...’ before ‘int32_t’
/tmp/vbox.4/include/iprt/asm.h: In function ‘ASMAtomicBitTestAndClear’:
/tmp/vbox.4/include/iprt/asm.h:3518: error: expected specifier-qualifier-list before ‘uint32_t’
/tmp/vbox.4/include/iprt/asm.h:3526: error: ‘union <anonymous>’ has no member named ‘u32’
/tmp/vbox.4/include/iprt/asm.h:3528: error: ‘iBit’ undeclared (first use in this function)
/tmp/vbox.4/include/iprt/asm.h:3523: error: invalid lvalue in asm output 0
/tmp/vbox.4/include/iprt/asm.h: At top level:
/tmp/vbox.4/include/iprt/asm.h:3562: error: expected declaration specifiers or ‘...’ before ‘int32_t’
/tmp/vbox.4/include/iprt/asm.h: In function ‘ASMBitTestAndToggle’:
/tmp/vbox.4/include/iprt/asm.h:3564: error: expected specifier-qualifier-list before ‘uint32_t’
/tmp/vbox.4/include/iprt/asm.h:3572: error: ‘union <anonymous>’ has no member named ‘u32’
/tmp/vbox.4/include/iprt/asm.h:3574: error: ‘iBit’ undeclared (first use in this function)
/tmp/vbox.4/include/iprt/asm.h:3569: error: invalid lvalue in asm output 0
/tmp/vbox.4/include/iprt/asm.h: At top level:
/tmp/vbox.4/include/iprt/asm.h:3608: error: expected declaration specifiers or ‘...’ before ‘int32_t’
/tmp/vbox.4/include/iprt/asm.h: In function ‘ASMAtomicBitTestAndToggle’:
/tmp/vbox.4/include/iprt/asm.h:3610: error: expected specifier-qualifier-list before ‘uint32_t’
/tmp/vbox.4/include/iprt/asm.h:3615: error: ‘union <anonymous>’ has no member named ‘u32’
/tmp/vbox.4/include/iprt/asm.h:3617: error: ‘iBit’ undeclared (first use in this function)
/tmp/vbox.4/include/iprt/asm.h:3612: error: invalid lvalue in asm output 0
/tmp/vbox.4/include/iprt/asm.h: At top level:
/tmp/vbox.4/include/iprt/asm.h:3651: error: expected declaration specifiers or ‘...’ before ‘int32_t’
/tmp/vbox.4/include/iprt/asm.h: In function ‘ASMBitTest’:
/tmp/vbox.4/include/iprt/asm.h:3653: error: expected specifier-qualifier-list before ‘uint32_t’
/tmp/vbox.4/include/iprt/asm.h:3661: error: ‘union <anonymous>’ has no member named ‘u32’
/tmp/vbox.4/include/iprt/asm.h:3663: error: ‘iBit’ undeclared (first use in this function)
/tmp/vbox.4/include/iprt/asm.h:3658: error: invalid lvalue in asm output 0
/tmp/vbox.4/include/iprt/asm.h: At top level:
/tmp/vbox.4/include/iprt/asm.h:3693: error: expected declaration specifiers or ‘...’ before ‘int32_t’
/tmp/vbox.4/include/iprt/asm.h:3693: error: expected declaration specifiers or ‘...’ before ‘int32_t’
/tmp/vbox.4/include/iprt/asm.h: In function ‘ASMBitClearRange’:
/tmp/vbox.4/include/iprt/asm.h:3695: error: ‘iBitStart’ undeclared (first use in this function)
/tmp/vbox.4/include/iprt/asm.h:3695: error: ‘iBitEnd’ undeclared (first use in this function)
/tmp/vbox.4/include/iprt/asm.h:3697: error: expected ‘=’, ‘,’, ‘;’, ‘asm’ or ‘__attribute__’ before ‘*’ token
/tmp/vbox.4/include/iprt/asm.h:3697: error: ‘pu32’ undeclared (first use in this function)
/tmp/vbox.4/include/iprt/asm.h:3697: error: expected ‘)’ before ‘uint32_t’
/tmp/vbox.4/include/iprt/asm.h:3697: warning: type defaults to ‘int’ in declaration of ‘type name’
/tmp/vbox.4/include/iprt/asm.h:3698: warning: ISO C90 forbids mixed declarations and code
/tmp/vbox.4/include/iprt/asm.h:3719: error: expected ‘)’ before ‘uint32_t’
/tmp/vbox.4/include/iprt/asm.h:3719: warning: type defaults to ‘int’ in declaration of ‘type name’
/tmp/vbox.4/include/iprt/asm.h: At top level:
/tmp/vbox.4/include/iprt/asm.h:3738: error: expected declaration specifiers or ‘...’ before ‘uint32_t’
/tmp/vbox.4/include/iprt/asm.h: In function ‘ASMBitFirstClear’:
/tmp/vbox.4/include/iprt/asm.h:3740: error: ‘cBits’ undeclared (first use in this function)
/tmp/vbox.4/include/iprt/asm.h:3742: error: ‘int32_t’ undeclared (first use in this function)
/tmp/vbox.4/include/iprt/asm.h:3742: error: expected ‘;’ before ‘iBit’
/tmp/vbox.4/include/iprt/asm.h:3744: error: ‘RTCCUINTREG’ undeclared (first use in this function)
/tmp/vbox.4/include/iprt/asm.h:3744: error: expected ‘;’ before ‘uEAX’
/tmp/vbox.4/include/iprt/asm.h:3745: error: ‘uint32_t’ undeclared (first use in this function)
/tmp/vbox.4/include/iprt/asm.h:3761: error: ‘iBit’ undeclared (first use in this function)
/tmp/vbox.4/include/iprt/asm.h:3762: error: ‘uECX’ undeclared (first use in this function)
/tmp/vbox.4/include/iprt/asm.h:3763: error: ‘uEDI’ undeclared (first use in this function)
/tmp/vbox.4/include/iprt/asm.h:3764: error: ‘uEAX’ undeclared (first use in this function)
/tmp/vbox.4/include/iprt/asm.h:3746: error: invalid lvalue in asm output 0
/tmp/vbox.4/include/iprt/asm.h:3746: error: invalid lvalue in asm output 1
/tmp/vbox.4/include/iprt/asm.h:3746: error: invalid lvalue in asm output 2
/tmp/vbox.4/include/iprt/asm.h:3746: error: invalid lvalue in asm output 3
/tmp/vbox.4/include/iprt/asm.h: At top level:
/tmp/vbox.4/include/iprt/asm.h:3824: error: expected declaration specifiers or ‘...’ before ‘uint32_t’
/tmp/vbox.4/include/iprt/asm.h:3824: error: expected declaration specifiers or ‘...’ before ‘uint32_t’
/tmp/vbox.4/include/iprt/asm.h: In function ‘ASMBitNextClear’:
/tmp/vbox.4/include/iprt/asm.h:3826: error: ‘iBitPrev’ undeclared (first use in this function)
/tmp/vbox.4/include/iprt/asm.h:3828: error: ‘cBits’ undeclared (first use in this function)
/tmp/vbox.4/include/iprt/asm.h:3832: error: ‘uint32_t’ undeclared (first use in this function)
/tmp/vbox.4/include/iprt/asm.h:3832: error: expected ‘;’ before ‘u32’
/tmp/vbox.4/include/iprt/asm.h:3845: error: ‘u32’ undeclared (first use in this function)
/tmp/vbox.4/include/iprt/asm.h:3863: error: too many arguments to function ‘ASMBitFirstClear’
/tmp/vbox.4/include/iprt/asm.h:3871: error: too many arguments to function ‘ASMBitFirstClear’
/tmp/vbox.4/include/iprt/asm.h: At top level:
/tmp/vbox.4/include/iprt/asm.h:3891: error: expected declaration specifiers or ‘...’ before ‘uint32_t’
/tmp/vbox.4/include/iprt/asm.h: In function ‘ASMBitFirstSet’:
/tmp/vbox.4/include/iprt/asm.h:3893: error: ‘cBits’ undeclared (first use in this function)
/tmp/vbox.4/include/iprt/asm.h:3895: error: ‘int32_t’ undeclared (first use in this function)
/tmp/vbox.4/include/iprt/asm.h:3895: error: expected ‘;’ before ‘iBit’
/tmp/vbox.4/include/iprt/asm.h:3897: error: ‘RTCCUINTREG’ undeclared (first use in this function)
/tmp/vbox.4/include/iprt/asm.h:3897: error: expected ‘;’ before ‘uEAX’
/tmp/vbox.4/include/iprt/asm.h:3898: error: ‘uint32_t’ undeclared (first use in this function)
/tmp/vbox.4/include/iprt/asm.h:3914: error: ‘iBit’ undeclared (first use in this function)
/tmp/vbox.4/include/iprt/asm.h:3915: error: ‘uECX’ undeclared (first use in this function)
/tmp/vbox.4/include/iprt/asm.h:3916: error: ‘uEDI’ undeclared (first use in this function)
/tmp/vbox.4/include/iprt/asm.h:3917: error: ‘uEAX’ undeclared (first use in this function)
/tmp/vbox.4/include/iprt/asm.h:3899: error: invalid lvalue in asm output 0
/tmp/vbox.4/include/iprt/asm.h:3899: error: invalid lvalue in asm output 1
/tmp/vbox.4/include/iprt/asm.h:3899: error: invalid lvalue in asm output 2
/tmp/vbox.4/include/iprt/asm.h:3899: error: invalid lvalue in asm output 3
/tmp/vbox.4/include/iprt/asm.h: At top level:
/tmp/vbox.4/include/iprt/asm.h:3976: error: expected declaration specifiers or ‘...’ before ‘uint32_t’
/tmp/vbox.4/include/iprt/asm.h:3976: error: expected declaration specifiers or ‘...’ before ‘uint32_t’
/tmp/vbox.4/include/iprt/asm.h: In function ‘ASMBitNextSet’:
/tmp/vbox.4/include/iprt/asm.h:3978: error: ‘iBitPrev’ undeclared (first use in this function)
/tmp/vbox.4/include/iprt/asm.h:3980: error: ‘cBits’ undeclared (first use in this function)
/tmp/vbox.4/include/iprt/asm.h:3984: error: ‘uint32_t’ undeclared (first use in this function)
/tmp/vbox.4/include/iprt/asm.h:3984: error: expected ‘;’ before ‘u32’
/tmp/vbox.4/include/iprt/asm.h:3997: error: ‘u32’ undeclared (first use in this function)
/tmp/vbox.4/include/iprt/asm.h:4015: error: too many arguments to function ‘ASMBitFirstSet’
/tmp/vbox.4/include/iprt/asm.h:4024: error: too many arguments to function ‘ASMBitFirstSet’
/tmp/vbox.4/include/iprt/asm.h: At top level:
/tmp/vbox.4/include/iprt/asm.h:4042: error: expected ‘)’ before ‘u32’
/tmp/vbox.4/include/iprt/asm.h:4088: error: expected ‘)’ before ‘i32’
/tmp/vbox.4/include/iprt/asm.h:4103: error: expected ‘)’ before ‘u32’
/tmp/vbox.4/include/iprt/asm.h:4149: error: expected ‘)’ before ‘i32’
/tmp/vbox.4/include/iprt/asm.h:4159: error: expected ‘=’, ‘,’, ‘;’, ‘asm’ or ‘__attribute__’ before ‘ASMByteSwapU32’
In file included from /tmp/vbox.4/SUPDRV.h:29,
from /tmp/vbox.4/linux/SUPDrv-linux.c:22:
/tmp/vbox.4/include/VBox/sup.h:38: error: expected specifier-qualifier-list before ‘RTHCPHYS’
/tmp/vbox.4/include/VBox/sup.h:92: error: expected ‘:’, ‘,’, ‘;’, ‘}’ or ‘__attribute__’ before ‘u32TransactionId’
/tmp/vbox.4/include/VBox/sup.h:117: error: conflicting types for ‘RTASSERTVAR’
/tmp/vbox.4/include/VBox/sup.h:117: error: previous declaration of ‘RTASSERTVAR’ was here
/tmp/vbox.4/include/VBox/sup.h:134: error: expected specifier-qualifier-list before ‘uint32_t’
/tmp/vbox.4/include/VBox/sup.h:230: error: expected ‘=’, ‘,’, ‘;’, ‘asm’ or ‘__attribute__’ before ‘SUPGetCpuHzFromGIP’
/tmp/vbox.4/include/VBox/sup.h:592: error: expected declaration specifiers or ‘...’ before ‘RTR3PTR’
/tmp/vbox.4/include/VBox/sup.h:592: error: expected declaration specifiers or ‘...’ before ‘uint32_t’
/tmp/vbox.4/include/VBox/sup.h:593: error: expected declaration specifiers or ‘...’ before ‘RTR3PTR’
/tmp/vbox.4/include/VBox/sup.h:594: error: expected declaration specifiers or ‘...’ before ‘uint32_t’
/tmp/vbox.4/include/VBox/sup.h:594: error: expected declaration specifiers or ‘...’ before ‘PRTR3PTR’
/tmp/vbox.4/include/VBox/sup.h:594: error: expected declaration specifiers or ‘...’ before ‘PRTHCPHYS’
/tmp/vbox.4/include/VBox/sup.h:595: error: expected declaration specifiers or ‘...’ before ‘RTHCUINTPTR’
/tmp/vbox.4/include/VBox/sup.h:596: error: expected declaration specifiers or ‘...’ before ‘uint32_t’
/tmp/vbox.4/include/VBox/sup.h:596: error: expected declaration specifiers or ‘...’ before ‘PRTR3PTR’
/tmp/vbox.4/include/VBox/sup.h:597: error: expected declaration specifiers or ‘...’ before ‘RTHCUINTPTR’
/tmp/vbox.4/include/VBox/sup.h:598: error: expected declaration specifiers or ‘...’ before ‘uint32_t’
/tmp/vbox.4/include/VBox/sup.h:598: error: expected declaration specifiers or ‘...’ before ‘PRTR3PTR’
/tmp/vbox.4/include/VBox/sup.h:599: error: expected declaration specifiers or ‘...’ before ‘RTHCUINTPTR’
/tmp/vbox.4/include/VBox/sup.h:600: error: expected declaration specifiers or ‘...’ before ‘RTHCUINTPTR’
/tmp/vbox.4/include/VBox/sup.h:601: error: expected declaration specifiers or ‘...’ before ‘uint32_t’
/tmp/vbox.4/include/VBox/sup.h:601: error: expected declaration specifiers or ‘...’ before ‘PRTR3PTR’
/tmp/vbox.4/include/VBox/sup.h:602: error: expected declaration specifiers or ‘...’ before ‘RTR3PTR’
/tmp/vbox.4/include/VBox/sup.h:603: error: expected declaration specifiers or ‘...’ before ‘PRTR3PTR’
/tmp/vbox.4/include/VBox/sup.h:603: error: expected declaration specifiers or ‘...’ before ‘PRTHCPHYS’
In file included from /tmp/vbox.4/SUPDRV.h:39,
from /tmp/vbox.4/linux/SUPDrv-linux.c:22:
/tmp/vbox.4/include/iprt/memobj.h:61: warning: data definition has no type or storage class
/tmp/vbox.4/include/iprt/memobj.h:61: warning: type defaults to ‘int’ in declaration of ‘RTR3PTR’
/tmp/vbox.4/include/iprt/memobj.h:61: warning: ‘cdecl’ attribute only applies to function types
/tmp/vbox.4/include/iprt/memobj.h:61: warning: ‘regparm’ attribute only applies to function types
/tmp/vbox.4/include/iprt/memobj.h:61: error: expected ‘,’ or ‘;’ before ‘RTR0MemObjAddressR3’
/tmp/vbox.4/include/iprt/memobj.h:82: warning: data definition has no type or storage class
/tmp/vbox.4/include/iprt/memobj.h:82: warning: type defaults to ‘int’ in declaration of ‘RTHCPHYS’
/tmp/vbox.4/include/iprt/memobj.h:82: warning: ‘cdecl’ attribute only applies to function types
/tmp/vbox.4/include/iprt/memobj.h:82: warning: ‘regparm’ attribute only applies to function types
/tmp/vbox.4/include/iprt/memobj.h:82: error: expected ‘,’ or ‘;’ before ‘RTR0MemObjGetPagePhysAddr’
/tmp/vbox.4/include/iprt/memobj.h:141: error: expected declaration specifiers or ‘...’ before ‘RTR3PTR’
/tmp/vbox.4/include/iprt/memobj.h:141: error: expected declaration specifiers or ‘...’ before ‘RTR0PROCESS’
/tmp/vbox.4/include/iprt/memobj.h:164: error: expected declaration specifiers or ‘...’ before ‘RTHCPHYS’
/tmp/vbox.4/include/iprt/memobj.h:182: error: expected declaration specifiers or ‘...’ before ‘RTHCPHYS’
/tmp/vbox.4/include/iprt/memobj.h:195: error: expected declaration specifiers or ‘...’ before ‘RTHCPHYS’
/tmp/vbox.4/include/iprt/memobj.h:224: error: expected declaration specifiers or ‘...’ before ‘RTR3PTR’
/tmp/vbox.4/include/iprt/memobj.h:224: error: expected declaration specifiers or ‘...’ before ‘RTR0PROCESS’
/tmp/vbox.4/include/iprt/memobj.h:251: error: expected declaration specifiers or ‘...’ before ‘RTR3PTR’
/tmp/vbox.4/include/iprt/memobj.h:251: error: expected declaration specifiers or ‘...’ before ‘RTR0PROCESS’
In file included from /tmp/vbox.4/SUPDRV.h:40,
from /tmp/vbox.4/linux/SUPDrv-linux.c:22:
/tmp/vbox.4/include/iprt/time.h:45: error: expected specifier-qualifier-list before ‘int64_t’
/tmp/vbox.4/include/iprt/time.h:62: error: expected ‘=’, ‘,’, ‘;’, ‘asm’ or ‘__attribute__’ before ‘RTTimeSpecGetNano’
/tmp/vbox.4/include/iprt/time.h:75: error: expected declaration specifiers or ‘...’ before ‘int64_t’
/tmp/vbox.4/include/iprt/time.h: In function ‘RTTimeSpecSetNano’:
/tmp/vbox.4/include/iprt/time.h:77: error: ‘RTTIMESPEC’ has no member named ‘i64NanosecondsRelativeToUnixEpoch’
/tmp/vbox.4/include/iprt/time.h:77: error: ‘i64Nano’ undeclared (first use in this function)
/tmp/vbox.4/include/iprt/time.h: At top level:
/tmp/vbox.4/include/iprt/time.h:88: error: expected ‘=’, ‘,’, ‘;’, ‘asm’ or ‘__attribute__’ before ‘RTTimeSpecGetMicro’
/tmp/vbox.4/include/iprt/time.h:101: error: expected declaration specifiers or ‘...’ before ‘int64_t’
/tmp/vbox.4/include/iprt/time.h: In function ‘RTTimeSpecSetMicro’:
/tmp/vbox.4/include/iprt/time.h:103: error: ‘RTTIMESPEC’ has no member named ‘i64NanosecondsRelativeToUnixEpoch’
/tmp/vbox.4/include/iprt/time.h:103: error: ‘i64Micro’ undeclared (first use in this function)
/tmp/vbox.4/include/iprt/time.h: At top level:
/tmp/vbox.4/include/iprt/time.h:114: error: expected ‘=’, ‘,’, ‘;’, ‘asm’ or ‘__attribute__’ before ‘RTTimeSpecGetMilli’
/tmp/vbox.4/include/iprt/time.h:127: error: expected declaration specifiers or ‘...’ before ‘int64_t’
/tmp/vbox.4/include/iprt/time.h: In function ‘RTTimeSpecSetMilli’:
/tmp/vbox.4/include/iprt/time.h:129: error: ‘RTTIMESPEC’ has no member named ‘i64NanosecondsRelativeToUnixEpoch’
/tmp/vbox.4/include/iprt/time.h:129: error: ‘i64Milli’ undeclared (first use in this function)
/tmp/vbox.4/include/iprt/time.h: At top level:
/tmp/vbox.4/include/iprt/time.h:140: error: expected ‘=’, ‘,’, ‘;’, ‘asm’ or ‘__attribute__’ before ‘RTTimeSpecGetSeconds’
/tmp/vbox.4/include/iprt/time.h:153: error: expected declaration specifiers or ‘...’ before ‘int64_t’
/tmp/vbox.4/include/iprt/time.h: In function ‘RTTimeSpecSetSeconds’:
/tmp/vbox.4/include/iprt/time.h:155: error: ‘RTTIMESPEC’ has no member named ‘i64NanosecondsRelativeToUnixEpoch’
/tmp/vbox.4/include/iprt/time.h:155: error: ‘i64Seconds’ undeclared (first use in this function)
/tmp/vbox.4/include/iprt/time.h: In function ‘RTTimeSpecAbsolute’:
/tmp/vbox.4/include/iprt/time.h:168: error: ‘RTTIMESPEC’ has no member named ‘i64NanosecondsRelativeToUnixEpoch’
/tmp/vbox.4/include/iprt/time.h:169: error: ‘RTTIMESPEC’ has no member named ‘i64NanosecondsRelativeToUnixEpoch’
/tmp/vbox.4/include/iprt/time.h:169: error: ‘RTTIMESPEC’ has no member named ‘i64NanosecondsRelativeToUnixEpoch’
/tmp/vbox.4/include/iprt/time.h: In function ‘RTTimeSpecNegate’:
/tmp/vbox.4/include/iprt/time.h:182: error: ‘RTTIMESPEC’ has no member named ‘i64NanosecondsRelativeToUnixEpoch’
/tmp/vbox.4/include/iprt/time.h:182: error: ‘RTTIMESPEC’ has no member named ‘i64NanosecondsRelativeToUnixEpoch’
/tmp/vbox.4/include/iprt/time.h: In function ‘RTTimeSpecAdd’:
/tmp/vbox.4/include/iprt/time.h:196: error: ‘RTTIMESPEC’ has no member named ‘i64NanosecondsRelativeToUnixEpoch’
/tmp/vbox.4/include/iprt/time.h:196: error: ‘RTTIMESPEC’ has no member named ‘i64NanosecondsRelativeToUnixEpoch’
/tmp/vbox.4/include/iprt/time.h: At top level:
/tmp/vbox.4/include/iprt/time.h:208: error: expected declaration specifiers or ‘...’ before ‘int64_t’
/tmp/vbox.4/include/iprt/time.h: In function ‘RTTimeSpecAddNano’:
/tmp/vbox.4/include/iprt/time.h:210: error: ‘RTTIMESPEC’ has no member named ‘i64NanosecondsRelativeToUnixEpoch’
/tmp/vbox.4/include/iprt/time.h:210: error: ‘i64Nano’ undeclared (first use in this function)
/tmp/vbox.4/include/iprt/time.h: At top level:
/tmp/vbox.4/include/iprt/time.h:222: error: expected declaration specifiers or ‘...’ before ‘int64_t’
/tmp/vbox.4/include/iprt/time.h: In function ‘RTTimeSpecAddMicro’:
/tmp/vbox.4/include/iprt/time.h:224: error: ‘RTTIMESPEC’ has no member named ‘i64NanosecondsRelativeToUnixEpoch’
/tmp/vbox.4/include/iprt/time.h:224: error: ‘i64Micro’ undeclared (first use in this function)
/tmp/vbox.4/include/iprt/time.h: At top level:
/tmp/vbox.4/include/iprt/time.h:236: error: expected declaration specifiers or ‘...’ before ‘int64_t’
/tmp/vbox.4/include/iprt/time.h: In function ‘RTTimeSpecAddMilli’:
/tmp/vbox.4/include/iprt/time.h:238: error: ‘RTTIMESPEC’ has no member named ‘i64NanosecondsRelativeToUnixEpoch’
/tmp/vbox.4/include/iprt/time.h:238: error: ‘i64Milli’ undeclared (first use in this function)
/tmp/vbox.4/include/iprt/time.h: At top level:
/tmp/vbox.4/include/iprt/time.h:250: error: expected declaration specifiers or ‘...’ before ‘int64_t’
/tmp/vbox.4/include/iprt/time.h: In function ‘RTTimeSpecAddSeconds’:
/tmp/vbox.4/include/iprt/time.h:252: error: ‘RTTIMESPEC’ has no member named ‘i64NanosecondsRelativeToUnixEpoch’
/tmp/vbox.4/include/iprt/time.h:252: error: ‘i64Seconds’ undeclared (first use in this function)
/tmp/vbox.4/include/iprt/time.h: In function ‘RTTimeSpecSub’:
/tmp/vbox.4/include/iprt/time.h:266: error: ‘RTTIMESPEC’ has no member named ‘i64NanosecondsRelativeToUnixEpoch’
/tmp/vbox.4/include/iprt/time.h:266: error: ‘RTTIMESPEC’ has no member named ‘i64NanosecondsRelativeToUnixEpoch’
/tmp/vbox.4/include/iprt/time.h: At top level:
/tmp/vbox.4/include/iprt/time.h:278: error: expected declaration specifiers or ‘...’ before ‘int64_t’
/tmp/vbox.4/include/iprt/time.h: In function ‘RTTimeSpecSubNano’:
/tmp/vbox.4/include/iprt/time.h:280: error: ‘RTTIMESPEC’ has no member named ‘i64NanosecondsRelativeToUnixEpoch’
/tmp/vbox.4/include/iprt/time.h:280: error: ‘i64Nano’ undeclared (first use in this function)
/tmp/vbox.4/include/iprt/time.h: At top level:
/tmp/vbox.4/include/iprt/time.h:292: error: expected declaration specifiers or ‘...’ before ‘int64_t’
/tmp/vbox.4/include/iprt/time.h: In function ‘RTTimeSpecSubMicro’:
/tmp/vbox.4/include/iprt/time.h:294: error: ‘RTTIMESPEC’ has no member named ‘i64NanosecondsRelativeToUnixEpoch’
/tmp/vbox.4/include/iprt/time.h:294: error: ‘i64Micro’ undeclared (first use in this function)
/tmp/vbox.4/include/iprt/time.h: At top level:
/tmp/vbox.4/include/iprt/time.h:306: error: expected declaration specifiers or ‘...’ before ‘int64_t’
/tmp/vbox.4/include/iprt/time.h: In function ‘RTTimeSpecSubMilli’:
/tmp/vbox.4/include/iprt/time.h:308: error: ‘RTTIMESPEC’ has no member named ‘i64NanosecondsRelativeToUnixEpoch’
/tmp/vbox.4/include/iprt/time.h:308: error: ‘i64Milli’ undeclared (first use in this function)
/tmp/vbox.4/include/iprt/time.h: At top level:
/tmp/vbox.4/include/iprt/time.h:320: error: expected declaration specifiers or ‘...’ before ‘int64_t’
/tmp/vbox.4/include/iprt/time.h: In function ‘RTTimeSpecSubSeconds’:
/tmp/vbox.4/include/iprt/time.h:322: error: ‘RTTIMESPEC’ has no member named ‘i64NanosecondsRelativeToUnixEpoch’
/tmp/vbox.4/include/iprt/time.h:322: error: ‘i64Seconds’ undeclared (first use in this function)
/tmp/vbox.4/include/iprt/time.h: At top level:
/tmp/vbox.4/include/iprt/time.h:415: error: expected ‘=’, ‘,’, ‘;’, ‘asm’ or ‘__attribute__’ before ‘RTTimeSpecGetNtTime’
/tmp/vbox.4/include/iprt/time.h:429: error: expected declaration specifiers or ‘...’ before ‘uint64_t’
/tmp/vbox.4/include/iprt/time.h: In function ‘RTTimeSpecSetNtTime’:
/tmp/vbox.4/include/iprt/time.h:431: error: ‘RTTIMESPEC’ has no member named ‘i64NanosecondsRelativeToUnixEpoch’
/tmp/vbox.4/include/iprt/time.h:432: error: ‘int64_t’ undeclared (first use in this function)
/tmp/vbox.4/include/iprt/time.h:432: error: expected ‘)’ before ‘u64NtTime’
/tmp/vbox.4/include/iprt/time.h: At top level:
/tmp/vbox.4/include/iprt/time.h:476: error: expected ‘=’, ‘,’, ‘;’, ‘asm’ or ‘__attribute__’ before ‘RTTimeSpecGetDosSeconds’
/tmp/vbox.4/include/iprt/time.h:490: error: expected declaration specifiers or ‘...’ before ‘int64_t’
/tmp/vbox.4/include/iprt/time.h: In function ‘RTTimeSpecSetDosSeconds’:
/tmp/vbox.4/include/iprt/time.h:492: error: ‘RTTIMESPEC’ has no member named ‘i64NanosecondsRelativeToUnixEpoch’
/tmp/vbox.4/include/iprt/time.h:492: error: ‘i64Seconds’ undeclared (first use in this function)
/tmp/vbox.4/include/iprt/time.h: In function ‘RTTimeSpecIsEqual’:
/tmp/vbox.4/include/iprt/time.h:508: error: ‘RTTIMESPEC’ has no member named ‘i64NanosecondsRelativeToUnixEpoch’
/tmp/vbox.4/include/iprt/time.h:508: error: ‘RTTIMESPEC’ has no member named ‘i64NanosecondsRelativeToUnixEpoch’
/tmp/vbox.4/include/iprt/time.h: At top level:
/tmp/vbox.4/include/iprt/time.h:532: error: expected specifier-qualifier-list before ‘int32_t’
/tmp/vbox.4/include/iprt/time.h:647: warning: data definition has no type or storage class
/tmp/vbox.4/include/iprt/time.h:647: warning: type defaults to ‘int’ in declaration of ‘int64_t’
/tmp/vbox.4/include/iprt/time.h:647: warning: ‘cdecl’ attribute only applies to function types
/tmp/vbox.4/include/iprt/time.h:647: warning: ‘regparm’ attribute only applies to function types
/tmp/vbox.4/include/iprt/time.h:647: error: expected ‘,’ or ‘;’ before ‘RTTimeLocalDeltaNano’
/tmp/vbox.4/include/iprt/time.h:674: warning: data definition has no type or storage class
/tmp/vbox.4/include/iprt/time.h:674: warning: type defaults to ‘int’ in declaration of ‘uint64_t’
/tmp/vbox.4/include/iprt/time.h:674: warning: ‘cdecl’ attribute only applies to function types
/tmp/vbox.4/include/iprt/time.h:674: warning: ‘regparm’ attribute only applies to function types
/tmp/vbox.4/include/iprt/time.h:674: error: expected ‘,’ or ‘;’ before ‘RTTimeNanoTS’
/tmp/vbox.4/include/iprt/time.h:681: warning: data definition has no type or storage class
/tmp/vbox.4/include/iprt/time.h:681: warning: type defaults to ‘int’ in declaration of ‘uint64_t’
/tmp/vbox.4/include/iprt/time.h:681: warning: ‘cdecl’ attribute only applies to function types
/tmp/vbox.4/include/iprt/time.h:681: warning: ‘regparm’ attribute only applies to function types
/tmp/vbox.4/include/iprt/time.h:681: error: expected ‘,’ or ‘;’ before ‘RTTimeMilliTS’
/tmp/vbox.4/include/iprt/time.h:688: warning: data definition has no type or storage class
/tmp/vbox.4/include/iprt/time.h:688: warning: type defaults to ‘int’ in declaration of ‘uint32_t’
/tmp/vbox.4/include/iprt/time.h:688: warning: ‘cdecl’ attribute only applies to function types
/tmp/vbox.4/include/iprt/time.h:688: warning: ‘regparm’ attribute only applies to function types
/tmp/vbox.4/include/iprt/time.h:688: error: expected ‘,’ or ‘;’ before ‘RTTime1nsSteps’
/tmp/vbox.4/include/iprt/time.h:698: warning: data definition has no type or storage class
/tmp/vbox.4/include/iprt/time.h:698: warning: type defaults to ‘int’ in declaration of ‘uint64_t’
/tmp/vbox.4/include/iprt/time.h:698: warning: ‘cdecl’ attribute only applies to function types
/tmp/vbox.4/include/iprt/time.h:698: warning: ‘regparm’ attribute only applies to function types
/tmp/vbox.4/include/iprt/time.h:698: error: expected ‘,’ or ‘;’ before ‘RTTimeSystemNanoTS’
/tmp/vbox.4/include/iprt/time.h:708: warning: data definition has no type or storage class
/tmp/vbox.4/include/iprt/time.h:708: warning: type defaults to ‘int’ in declaration of ‘uint64_t’
/tmp/vbox.4/include/iprt/time.h:708: warning: ‘cdecl’ attribute only applies to function types
/tmp/vbox.4/include/iprt/time.h:708: warning: ‘regparm’ attribute only applies to function types
/tmp/vbox.4/include/iprt/time.h:708: error: expected ‘,’ or ‘;’ before ‘RTTimeSystemMilliTS’
/tmp/vbox.4/include/iprt/time.h:715: warning: data definition has no type or storage class
/tmp/vbox.4/include/iprt/time.h:715: warning: type defaults to ‘int’ in declaration of ‘uint64_t’
/tmp/vbox.4/include/iprt/time.h:715: warning: ‘cdecl’ attribute only applies to function types
/tmp/vbox.4/include/iprt/time.h:715: warning: ‘regparm’ attribute only applies to function types
/tmp/vbox.4/include/iprt/time.h:715: error: expected ‘,’ or ‘;’ before ‘RTTimeProgramNanoTS’
/tmp/vbox.4/include/iprt/time.h:722: warning: data definition has no type or storage class
/tmp/vbox.4/include/iprt/time.h:722: warning: type defaults to ‘int’ in declaration of ‘uint64_t’
/tmp/vbox.4/include/iprt/time.h:722: warning: ‘cdecl’ attribute only applies to function types
/tmp/vbox.4/include/iprt/time.h:722: warning: ‘regparm’ attribute only applies to function types
/tmp/vbox.4/include/iprt/time.h:722: error: expected ‘,’ or ‘;’ before ‘RTTimeProgramMicroTS’
/tmp/vbox.4/include/iprt/time.h:729: warning: data definition has no type or storage class
/tmp/vbox.4/include/iprt/time.h:729: warning: type defaults to ‘int’ in declaration of ‘uint64_t’
/tmp/vbox.4/include/iprt/time.h:729: warning: ‘cdecl’ attribute only applies to function types
/tmp/vbox.4/include/iprt/time.h:729: warning: ‘regparm’ attribute only applies to function types
/tmp/vbox.4/include/iprt/time.h:729: error: expected ‘,’ or ‘;’ before ‘RTTimeProgramMilliTS’
/tmp/vbox.4/include/iprt/time.h:736: warning: data definition has no type or storage class
/tmp/vbox.4/include/iprt/time.h:736: warning: type defaults to ‘int’ in declaration of ‘uint32_t’
/tmp/vbox.4/include/iprt/time.h:736: warning: ‘cdecl’ attribute only applies to function types
/tmp/vbox.4/include/iprt/time.h:736: warning: ‘regparm’ attribute only applies to function types
/tmp/vbox.4/include/iprt/time.h:736: error: expected ‘,’ or ‘;’ before ‘RTTimeProgramSecTS’
/tmp/vbox.4/include/iprt/time.h:743: warning: data definition has no type or storage class
/tmp/vbox.4/include/iprt/time.h:743: warning: type defaults to ‘int’ in declaration of ‘uint64_t’
/tmp/vbox.4/include/iprt/time.h:743: warning: ‘cdecl’ attribute only applies to function types
/tmp/vbox.4/include/iprt/time.h:743: warning: ‘regparm’ attribute only applies to function types
/tmp/vbox.4/include/iprt/time.h:743: error: expected ‘,’ or ‘;’ before ‘RTTimeProgramStartNanoTS’
In file included from /tmp/vbox.4/SUPDRV.h:41,
from /tmp/vbox.4/linux/SUPDrv-linux.c:22:
/tmp/vbox.4/include/iprt/timer.h:101: error: expected declaration specifiers or ‘...’ before ‘uint64_t’
/tmp/vbox.4/include/iprt/timer.h:140: error: expected declaration specifiers or ‘...’ before ‘uint64_t’
/tmp/vbox.4/include/iprt/timer.h:162: warning: data definition has no type or storage class
/tmp/vbox.4/include/iprt/timer.h:162: warning: type defaults to ‘int’ in declaration of ‘uint32_t’
/tmp/vbox.4/include/iprt/timer.h:162: warning: ‘cdecl’ attribute only applies to function types
/tmp/vbox.4/include/iprt/timer.h:162: warning: ‘regparm’ attribute only applies to function types
/tmp/vbox.4/include/iprt/timer.h:162: error: expected ‘,’ or ‘;’ before ‘RTTimerGetSystemGranularity’
/tmp/vbox.4/include/iprt/timer.h:188: error: expected ‘)’ before ‘u32Request’
/tmp/vbox.4/include/iprt/timer.h:201: error: expected ‘)’ before ‘u32Granted’
In file included from /tmp/vbox.4/include/iprt/string.h:23,
from /tmp/vbox.4/SUPDRV.h:42,
from /tmp/vbox.4/linux/SUPDrv-linux.c:22:
/tmp/vbox.4/include/iprt/err.h:84: error: expected ‘)’ before ‘iNativeCode’
In file included from /tmp/vbox.4/include/iprt/string.h:25,
from /tmp/vbox.4/SUPDRV.h:42,
from /tmp/vbox.4/linux/SUPDrv-linux.c:22:
include/linux/string.h:21:24: error: asm/string.h: No such file or directory
In file included from /tmp/vbox.4/include/iprt/string.h:25,
from /tmp/vbox.4/SUPDRV.h:42,
from /tmp/vbox.4/linux/SUPDrv-linux.c:22:
include/linux/string.h:27: error: expected declaration specifiers or ‘...’ before ‘__kernel_size_t’
include/linux/string.h:36: error: expected declaration specifiers or ‘...’ before ‘__kernel_size_t’
include/linux/string.h:39: error: expected declaration specifiers or ‘...’ before ‘__kernel_size_t’
include/linux/string.h:45: error: expected declaration specifiers or ‘...’ before ‘__kernel_size_t’
include/linux/string.h:48: error: expected declaration specifiers or ‘...’ before ‘__kernel_size_t’
include/linux/string.h:70: error: expected ‘=’, ‘,’, ‘;’, ‘asm’ or ‘__attribute__’ before ‘strlen’
include/linux/string.h:73: error: expected ‘=’, ‘,’, ‘;’, ‘asm’ or ‘__attribute__’ before ‘strnlen’
include/linux/string.h:82: error: expected ‘=’, ‘,’, ‘;’, ‘asm’ or ‘__attribute__’ before ‘strspn’
include/linux/string.h:85: error: expected ‘=’, ‘,’, ‘;’, ‘asm’ or ‘__attribute__’ before ‘strcspn’
include/linux/string.h:89: error: expected declaration specifiers or ‘...’ before ‘__kernel_size_t’
include/linux/string.h:92: error: expected declaration specifiers or ‘...’ before ‘__kernel_size_t’
include/linux/string.h:95: error: expected declaration specifiers or ‘...’ before ‘__kernel_size_t’
include/linux/string.h:98: error: expected declaration specifiers or ‘...’ before ‘__kernel_size_t’
include/linux/string.h:101: error: expected declaration specifiers or ‘...’ before ‘__kernel_size_t’
include/linux/string.h:104: error: expected declaration specifiers or ‘...’ before ‘__kernel_size_t’
In file included from /tmp/vbox.4/SUPDRV.h:42,
from /tmp/vbox.4/linux/SUPDrv-linux.c:22:
/tmp/vbox.4/include/iprt/string.h:162: error: expected declaration specifiers or ‘...’ before ‘PRTUNICP’
/tmp/vbox.4/include/iprt/string.h:184: error: expected declaration specifiers or ‘...’ before ‘PRTUNICP’
/tmp/vbox.4/include/iprt/string.h:222: error: expected declaration specifiers or ‘...’ before ‘PRTUTF16’
/tmp/vbox.4/include/iprt/string.h:243: error: expected declaration specifiers or ‘...’ before ‘PRTUTF16’
/tmp/vbox.4/include/iprt/string.h:254: error: expected ‘)’ before ‘*’ token
/tmp/vbox.4/include/iprt/string.h:270: error: expected ‘)’ before ‘*’ token
/tmp/vbox.4/include/iprt/string.h:283: warning: data definition has no type or storage class
/tmp/vbox.4/include/iprt/string.h:283: warning: type defaults to ‘int’ in declaration of ‘RTUNICP’
/tmp/vbox.4/include/iprt/string.h:283: warning: ‘cdecl’ attribute only applies to function types
/tmp/vbox.4/include/iprt/string.h:283: warning: ‘regparm’ attribute only applies to function types
/tmp/vbox.4/include/iprt/string.h:283: error: expected ‘,’ or ‘;’ before ‘RTStrGetCpInternal’
/tmp/vbox.4/include/iprt/string.h:293: error: expected declaration specifiers or ‘...’ before ‘PRTUNICP’
/tmp/vbox.4/include/iprt/string.h:312: error: expected declaration specifiers or ‘...’ before ‘RTUNICP’
/tmp/vbox.4/include/iprt/string.h:325: error: expected ‘=’, ‘,’, ‘;’, ‘asm’ or ‘__attribute__’ before ‘RTStrGetCp’
/tmp/vbox.4/include/iprt/string.h:346: error: expected declaration specifiers or ‘...’ before ‘PRTUNICP’
/tmp/vbox.4/include/iprt/string.h: In function ‘RTStrGetCpEx’:
/tmp/vbox.4/include/iprt/string.h:352: error: ‘pCp’ undeclared (first use in this function)
/tmp/vbox.4/include/iprt/string.h:355: error: too many arguments to function ‘RTStrGetCpExInternal’
/tmp/vbox.4/include/iprt/string.h: At top level:
/tmp/vbox.4/include/iprt/string.h:376: error: expected declaration specifiers or ‘...’ before ‘RTUNICP’
/tmp/vbox.4/include/iprt/string.h: In function ‘RTStrPutCp’:
/tmp/vbox.4/include/iprt/string.h:378: error: ‘CodePoint’ undeclared (first use in this function)
/tmp/vbox.4/include/iprt/string.h:383: error: too many arguments to function ‘RTStrPutCpInternal’
/tmp/vbox.4/include/iprt/string.h: In function ‘RTStrNextCp’:
/tmp/vbox.4/include/iprt/string.h:395: warning: statement with no effect
/tmp/vbox.4/include/iprt/string.h:395: error: expected ‘;’ before ‘Cp’
/tmp/vbox.4/include/iprt/string.h:396: error: ‘Cp’ undeclared (first use in this function)
/tmp/vbox.4/include/iprt/string.h:396: error: too many arguments to function ‘RTStrGetCpEx’
/tmp/vbox.4/include/iprt/string.h: At top level:
/tmp/vbox.4/include/iprt/string.h:527: error: expected declaration specifiers or ‘...’ before ‘uint64_t’
/tmp/vbox.4/include/iprt/string.h:653: error: expected declaration specifiers or ‘...’ before ‘uint64_t’
/tmp/vbox.4/include/iprt/string.h:673: error: expected declaration specifiers or ‘...’ before ‘uint64_t’
/tmp/vbox.4/include/iprt/string.h:683: warning: data definition has no type or storage class
/tmp/vbox.4/include/iprt/string.h:683: warning: type defaults to ‘int’ in declaration of ‘uint64_t’
/tmp/vbox.4/include/iprt/string.h:683: warning: ‘cdecl’ attribute only applies to function types
/tmp/vbox.4/include/iprt/string.h:683: warning: ‘regparm’ attribute only applies to function types
/tmp/vbox.4/include/iprt/string.h:683: error: expected ‘,’ or ‘;’ before ‘RTStrToUInt64’
/tmp/vbox.4/include/iprt/string.h:703: error: expected declaration specifiers or ‘...’ before ‘uint32_t’
/tmp/vbox.4/include/iprt/string.h:723: error: expected declaration specifiers or ‘...’ before ‘uint32_t’
/tmp/vbox.4/include/iprt/string.h:733: warning: data definition has no type or storage class
/tmp/vbox.4/include/iprt/string.h:733: warning: type defaults to ‘int’ in declaration of ‘uint32_t’
/tmp/vbox.4/include/iprt/string.h:733: warning: ‘cdecl’ attribute only applies to function types
/tmp/vbox.4/include/iprt/string.h:733: warning: ‘regparm’ attribute only applies to function types
/tmp/vbox.4/include/iprt/string.h:733: error: expected ‘,’ or ‘;’ before ‘RTStrToUInt32’
/tmp/vbox.4/include/iprt/string.h:753: error: expected declaration specifiers or ‘...’ before ‘uint16_t’
/tmp/vbox.4/include/iprt/string.h:773: error: expected declaration specifiers or ‘...’ before ‘uint16_t’
/tmp/vbox.4/include/iprt/string.h:783: warning: data definition has no type or storage class
/tmp/vbox.4/include/iprt/string.h:783: warning: type defaults to ‘int’ in declaration of ‘uint16_t’
/tmp/vbox.4/include/iprt/string.h:783: warning: ‘cdecl’ attribute only applies to function types
/tmp/vbox.4/include/iprt/string.h:783: warning: ‘regparm’ attribute only applies to function types
/tmp/vbox.4/include/iprt/string.h:783: error: expected ‘,’ or ‘;’ before ‘RTStrToUInt16’
/tmp/vbox.4/include/iprt/string.h:803: error: expected declaration specifiers or ‘...’ before ‘uint8_t’
/tmp/vbox.4/include/iprt/string.h:823: error: expected declaration specifiers or ‘...’ before ‘uint8_t’
/tmp/vbox.4/include/iprt/string.h:833: warning: data definition has no type or storage class
/tmp/vbox.4/include/iprt/string.h:833: warning: type defaults to ‘int’ in declaration of ‘uint8_t’
/tmp/vbox.4/include/iprt/string.h:833: warning: ‘cdecl’ attribute only applies to function types
/tmp/vbox.4/include/iprt/string.h:833: warning: ‘regparm’ attribute only applies to function types
/tmp/vbox.4/include/iprt/string.h:833: error: expected ‘,’ or ‘;’ before ‘RTStrToUInt8’
/tmp/vbox.4/include/iprt/string.h:852: error: expected declaration specifiers or ‘...’ before ‘int64_t’
/tmp/vbox.4/include/iprt/string.h:871: error: expected declaration specifiers or ‘...’ before ‘int64_t’
/tmp/vbox.4/include/iprt/string.h:881: warning: data definition has no type or storage class
/tmp/vbox.4/include/iprt/string.h:881: warning: type defaults to ‘int’ in declaration of ‘int64_t’
/tmp/vbox.4/include/iprt/string.h:881: warning: ‘cdecl’ attribute only applies to function types
/tmp/vbox.4/include/iprt/string.h:881: warning: ‘regparm’ attribute only applies to function types
/tmp/vbox.4/include/iprt/string.h:881: error: expected ‘,’ or ‘;’ before ‘RTStrToInt64’
/tmp/vbox.4/include/iprt/string.h:900: error: expected declaration specifiers or ‘...’ before ‘int32_t’
/tmp/vbox.4/include/iprt/string.h:919: error: expected declaration specifiers or ‘...’ before ‘int32_t’
/tmp/vbox.4/include/iprt/string.h:929: warning: data definition has no type or storage class
/tmp/vbox.4/include/iprt/string.h:929: warning: type defaults to ‘int’ in declaration of ‘int32_t’
/tmp/vbox.4/include/iprt/string.h:929: warning: ‘cdecl’ attribute only applies to function types
/tmp/vbox.4/include/iprt/string.h:929: warning: ‘regparm’ attribute only applies to function types
/tmp/vbox.4/include/iprt/string.h:929: error: expected ‘,’ or ‘;’ before ‘RTStrToInt32’
/tmp/vbox.4/include/iprt/string.h:948: error: expected declaration specifiers or ‘...’ before ‘int16_t’
/tmp/vbox.4/include/iprt/string.h:967: error: expected declaration specifiers or ‘...’ before ‘int16_t’
/tmp/vbox.4/include/iprt/string.h:977: warning: data definition has no type or storage class
/tmp/vbox.4/include/iprt/string.h:977: warning: type defaults to ‘int’ in declaration of ‘int16_t’
/tmp/vbox.4/include/iprt/string.h:977: warning: ‘cdecl’ attribute only applies to function types
/tmp/vbox.4/include/iprt/string.h:977: warning: ‘regparm’ attribute only applies to function types
/tmp/vbox.4/include/iprt/string.h:977: error: expected ‘,’ or ‘;’ before ‘RTStrToInt16’
/tmp/vbox.4/include/iprt/string.h:996: error: expected declaration specifiers or ‘...’ before ‘int8_t’
/tmp/vbox.4/include/iprt/string.h:1015: error: expected declaration specifiers or ‘...’ before ‘int8_t’
/tmp/vbox.4/include/iprt/string.h:1025: warning: data definition has no type or storage class
/tmp/vbox.4/include/iprt/string.h:1025: warning: type defaults to ‘int’ in declaration of ‘int8_t’
/tmp/vbox.4/include/iprt/string.h:1025: warning: ‘cdecl’ attribute only applies to function types
/tmp/vbox.4/include/iprt/string.h:1025: warning: ‘regparm’ attribute only applies to function types
/tmp/vbox.4/include/iprt/string.h:1025: error: expected ‘,’ or ‘;’ before ‘RTStrToInt8’
/tmp/vbox.4/include/iprt/string.h:1061: error: expected specifier-qualifier-list before ‘uint32_t’
/tmp/vbox.4/include/iprt/string.h:1165: error: expected ‘)’ before ‘pwszString’
/tmp/vbox.4/include/iprt/string.h:1175: warning: data definition has no type or storage class
/tmp/vbox.4/include/iprt/string.h:1175: warning: type defaults to ‘int’ in declaration of ‘PRTUTF16’
/tmp/vbox.4/include/iprt/string.h:1175: warning: ‘cdecl’ attribute only applies to function types
/tmp/vbox.4/include/iprt/string.h:1175: warning: ‘regparm’ attribute only applies to function types
/tmp/vbox.4/include/iprt/string.h:1175: error: expected ‘,’ or ‘;’ before ‘RTUtf16Dup’
/tmp/vbox.4/include/iprt/string.h:1187: error: expected ‘)’ before ‘*’ token
/tmp/vbox.4/include/iprt/string.h:1200: error: expected ‘)’ before ‘pwszString’
/tmp/vbox.4/include/iprt/string.h:1212: warning: type defaults to ‘int’ in declaration of ‘PCRTUTF16’
/tmp/vbox.4/include/iprt/string.h:1212: error: expected ‘;’, ‘,’ or ‘)’ before ‘pwsz1’
/tmp/vbox.4/include/iprt/string.h:1227: error: expected ‘)’ before ‘pwsz1’
/tmp/vbox.4/include/iprt/string.h:1243: error: expected ‘)’ before ‘pwsz1’
/tmp/vbox.4/include/iprt/string.h:1256: warning: data definition has no type or storage class
/tmp/vbox.4/include/iprt/string.h:1256: warning: type defaults to ‘int’ in declaration of ‘PRTUTF16’
/tmp/vbox.4/include/iprt/string.h:1256: warning: ‘cdecl’ attribute only applies to function types
/tmp/vbox.4/include/iprt/string.h:1256: warning: ‘regparm’ attribute only applies to function types
/tmp/vbox.4/include/iprt/string.h:1256: error: expected ‘,’ or ‘;’ before ‘RTUtf16ToLower’
/tmp/vbox.4/include/iprt/string.h:1269: warning: data definition has no type or storage class
/tmp/vbox.4/include/iprt/string.h:1269: warning: type defaults to ‘int’ in declaration of ‘PRTUTF16’
/tmp/vbox.4/include/iprt/string.h:1269: warning: ‘cdecl’ attribute only applies to function types
/tmp/vbox.4/include/iprt/string.h:1269: warning: ‘regparm’ attribute only applies to function types
/tmp/vbox.4/include/iprt/string.h:1269: error: expected ‘,’ or ‘;’ before ‘RTUtf16ToUpper’
/tmp/vbox.4/include/iprt/string.h:1279: error: expected ‘)’ before ‘pwszString’
/tmp/vbox.4/include/iprt/string.h:1301: error: expected ‘)’ before ‘pwszString’
/tmp/vbox.4/include/iprt/string.h:1313: error: expected declaration specifiers or ‘...’ before ‘PCRTUCS2’
/tmp/vbox.4/include/iprt/string.h: In function ‘RTStrUcs2ToUtf8’:
/tmp/vbox.4/include/iprt/string.h:1315: warning: implicit declaration of function ‘RTUtf16ToUtf8’
/tmp/vbox.4/include/iprt/string.h:1315: error: ‘pwszString’ undeclared (first use in this function)
/tmp/vbox.4/include/iprt/string.h: At top level:
/tmp/vbox.4/include/iprt/string.h:1333: error: expected declaration specifiers or ‘...’ before ‘PCRTUCS2’
/tmp/vbox.4/include/iprt/string.h: In function ‘RTStrUcs2ToUtf8Ex’:
/tmp/vbox.4/include/iprt/string.h:1335: warning: implicit declaration of function ‘RTUtf16ToUtf8Ex’
/tmp/vbox.4/include/iprt/string.h:1335: error: ‘pwszString’ undeclared (first use in this function)
/tmp/vbox.4/include/iprt/string.h: At top level:
/tmp/vbox.4/include/iprt/string.h:1346: error: expected ‘)’ before ‘pwszString’
/tmp/vbox.4/include/iprt/string.h:1359: error: expected ‘=’, ‘,’, ‘;’, ‘asm’ or ‘__attribute__’ before ‘RTStrUcs2Dup’
/tmp/vbox.4/include/iprt/string.h:1373: error: expected ‘)’ before ‘*’ token
/tmp/vbox.4/include/iprt/string.h:1386: error: expected ‘)’ before ‘pwszString’
/tmp/vbox.4/include/iprt/string.h:1401: warning: type defaults to ‘int’ in declaration of ‘PCRTUCS2’
/tmp/vbox.4/include/iprt/string.h:1401: error: expected ‘;’, ‘,’ or ‘)’ before ‘pwsz1’
/tmp/vbox.4/include/iprt/string.h:1416: warning: data definition has no type or storage class
/tmp/vbox.4/include/iprt/string.h:1416: warning: type defaults to ‘int’ in declaration of ‘RTUNICP’
/tmp/vbox.4/include/iprt/string.h:1416: warning: ‘cdecl’ attribute only applies to function types
/tmp/vbox.4/include/iprt/string.h:1416: warning: ‘regparm’ attribute only applies to function types
/tmp/vbox.4/include/iprt/string.h:1416: error: expected ‘,’ or ‘;’ before ‘RTUtf16GetCpInternal’
/tmp/vbox.4/include/iprt/string.h:1429: error: expected ‘)’ before ‘*’ token
/tmp/vbox.4/include/iprt/string.h:1447: warning: data definition has no type or storage class
/tmp/vbox.4/include/iprt/string.h:1447: warning: type defaults to ‘int’ in declaration of ‘PRTUTF16’
/tmp/vbox.4/include/iprt/string.h:1447: warning: ‘cdecl’ attribute only applies to function types
/tmp/vbox.4/include/iprt/string.h:1447: warning: ‘regparm’ attribute only applies to function types
/tmp/vbox.4/include/iprt/string.h:1447: error: expected ‘,’ or ‘;’ before ‘RTUtf16PutCpInternal’
/tmp/vbox.4/include/iprt/string.h:1459: error: expected ‘=’, ‘,’, ‘;’, ‘asm’ or ‘__attribute__’ before ‘RTUtf16GetCp’
/tmp/vbox.4/include/iprt/string.h:1479: error: expected ‘)’ before ‘*’ token
/tmp/vbox.4/include/iprt/string.h:1508: error: expected ‘=’, ‘,’, ‘;’, ‘asm’ or ‘__attribute__’ before ‘RTUtf16PutCp’
/tmp/vbox.4/include/iprt/string.h:1525: error: expected ‘=’, ‘,’, ‘;’, ‘asm’ or ‘__attribute__’ before ‘RTUtf16NextCp’
/tmp/vbox.4/include/iprt/string.h:1539: warning: data definition has no type or storage class
/tmp/vbox.4/include/iprt/string.h:1539: warning: type defaults to ‘int’ in declaration of ‘PRTUTF16’
/tmp/vbox.4/include/iprt/string.h:1539: warning: ‘cdecl’ attribute only applies to function types
/tmp/vbox.4/include/iprt/string.h:1539: warning: ‘regparm’ attribute only applies to function types
/tmp/vbox.4/include/iprt/string.h:1539: error: expected ‘,’ or ‘;’ before ‘RTUtf16PrevCp’
/tmp/vbox.4/include/iprt/string.h:1550: error: expected ‘)’ before ‘wc’
/tmp/vbox.4/include/iprt/string.h:1563: error: expected ‘)’ before ‘wc’
/tmp/vbox.4/include/iprt/string.h:1577: error: expected ‘)’ before ‘wcHigh’
In file included from /tmp/vbox.4/linux/SUPDrv-linux.c:22:
/tmp/vbox.4/SUPDRV.h:69:30: error: linux/version.h: No such file or directory
/tmp/vbox.4/SUPDRV.h:76:8: warning: "LINUX_VERSION_CODE" is not defined
/tmp/vbox.4/SUPDRV.h:76:29: warning: "KERNEL_VERSION" is not defined
/tmp/vbox.4/SUPDRV.h:76:43: error: missing binary operator before token "("
In file included from include/linux/thread_info.h:20,
from include/linux/preempt.h:9,
from include/linux/spinlock.h:49,
from /tmp/vbox.4/SUPDRV.h:87,
from /tmp/vbox.4/linux/SUPDrv-linux.c:22:
include/linux/bitops.h:9:24: error: asm/bitops.h: No such file or directory
In file included from include/linux/thread_info.h:20,
from include/linux/preempt.h:9,
from include/linux/spinlock.h:49,
from /tmp/vbox.4/SUPDRV.h:87,
from /tmp/vbox.4/linux/SUPDrv-linux.c:22:
include/linux/bitops.h: In function ‘get_bitmask_order’:
include/linux/bitops.h:15: warning: implicit declaration of function ‘fls’
include/linux/bitops.h: In function ‘hweight_long’:
include/linux/bitops.h:31: warning: implicit declaration of function ‘hweight32’
include/linux/bitops.h:31: warning: implicit declaration of function ‘hweight64’
include/linux/bitops.h: At top level:
include/linux/bitops.h:39: error: expected ‘=’, ‘,’, ‘;’, ‘asm’ or ‘__attribute__’ before ‘rol32’
include/linux/bitops.h:49: error: expected ‘=’, ‘,’, ‘;’, ‘asm’ or ‘__attribute__’ before ‘ror32’
include/linux/bitops.h: In function ‘fls_long’:
include/linux/bitops.h:58: warning: implicit declaration of function ‘fls64’
In file included from include/linux/preempt.h:9,
from include/linux/spinlock.h:49,
from /tmp/vbox.4/SUPDRV.h:87,
from /tmp/vbox.4/linux/SUPDrv-linux.c:22:
include/linux/thread_info.h:21:29: error: asm/thread_info.h: No such file or directory
In file included from include/linux/preempt.h:9,
from include/linux/spinlock.h:49,
from /tmp/vbox.4/SUPDRV.h:87,
from /tmp/vbox.4/linux/SUPDrv-linux.c:22:
include/linux/thread_info.h: At top level:
include/linux/thread_info.h:30: warning: ‘struct thread_info’ declared inside parameter list
include/linux/thread_info.h:30: warning: its scope is only this definition or declaration, which is probably not what you want
include/linux/thread_info.h: In function ‘set_ti_thread_flag’:
include/linux/thread_info.h:32: warning: implicit declaration of function ‘set_bit’
include/linux/thread_info.h:32: error: dereferencing pointer to incomplete type
include/linux/thread_info.h: At top level:
include/linux/thread_info.h:35: warning: ‘struct thread_info’ declared inside parameter list
include/linux/thread_info.h: In function ‘clear_ti_thread_flag’:
include/linux/thread_info.h:37: warning: implicit declaration of function ‘clear_bit’
include/linux/thread_info.h:37: error: dereferencing pointer to incomplete type
include/linux/thread_info.h: At top level:
include/linux/thread_info.h:40: warning: ‘struct thread_info’ declared inside parameter list
include/linux/thread_info.h: In function ‘test_and_set_ti_thread_flag’:
include/linux/thread_info.h:42: warning: implicit declaration of function ‘test_and_set_bit’
include/linux/thread_info.h:42: error: dereferencing pointer to incomplete type
include/linux/thread_info.h: At top level:
include/linux/thread_info.h:45: warning: ‘struct thread_info’ declared inside parameter list
include/linux/thread_info.h: In function ‘test_and_clear_ti_thread_flag’:
include/linux/thread_info.h:47: warning: implicit declaration of function ‘test_and_clear_bit’
include/linux/thread_info.h:47: error: dereferencing pointer to incomplete type
include/linux/thread_info.h: At top level:
include/linux/thread_info.h:50: warning: ‘struct thread_info’ declared inside parameter list
include/linux/thread_info.h: In function ‘test_ti_thread_flag’:
include/linux/thread_info.h:52: warning: implicit declaration of function ‘test_bit’
include/linux/thread_info.h:52: error: dereferencing pointer to incomplete type
In file included from include/linux/preempt.h:10,
from include/linux/spinlock.h:49,
from /tmp/vbox.4/SUPDRV.h:87,
from /tmp/vbox.4/linux/SUPDrv-linux.c:22:
include/linux/linkage.h:4:25: error: asm/linkage.h: No such file or directory
In file included from include/linux/kernel.h:16,
from include/linux/spinlock.h:53,
from /tmp/vbox.4/SUPDRV.h:87,
from /tmp/vbox.4/linux/SUPDrv-linux.c:22:
include/linux/log2.h: At top level:
include/linux/log2.h:32: error: expected ‘)’ before ‘n’
include/linux/log2.h:40: error: expected ‘)’ before ‘n’
In file included from include/linux/spinlock.h:53,
from /tmp/vbox.4/SUPDRV.h:87,
from /tmp/vbox.4/linux/SUPDrv-linux.c:22:
include/linux/kernel.h:17:27: error: asm/byteorder.h: No such file or directory
include/linux/kernel.h:18:21: error: asm/bug.h: No such file or directory
include/linux/kernel.h:279:2: error: #error "Please fix asm/byteorder.h"
In file included from /tmp/vbox.4/SUPDRV.h:87,
from /tmp/vbox.4/linux/SUPDrv-linux.c:22:
include/linux/spinlock.h:57:24: error: asm/system.h: No such file or directory
include/linux/spinlock.h:326:24: error: asm/atomic.h: No such file or directory
In file included from /tmp/vbox.4/SUPDRV.h:87,
from /tmp/vbox.4/linux/SUPDrv-linux.c:22:
include/linux/spinlock.h:332: error: expected ‘)’ before ‘*’ token
In file included from include/linux/list.h:8,
from include/linux/mmzone.h:8,
from include/linux/gfp.h:4,
from include/linux/slab.h:14,
from /tmp/vbox.4/SUPDRV.h:88,
from /tmp/vbox.4/linux/SUPDrv-linux.c:22:
include/linux/prefetch.h:14:27: error: asm/processor.h: No such file or directory
include/linux/prefetch.h:15:23: error: asm/cache.h: No such file or directory
In file included from include/linux/mmzone.h:8,
from include/linux/gfp.h:4,
from include/linux/slab.h:14,
from /tmp/vbox.4/SUPDRV.h:88,
from /tmp/vbox.4/linux/SUPDrv-linux.c:22:
include/linux/list.h: In function ‘__list_add_rcu’:
include/linux/list.h:100: warning: implicit declaration of function ‘smp_wmb’
In file included from include/linux/mmzone.h:9,
from include/linux/gfp.h:4,
from include/linux/slab.h:14,
from /tmp/vbox.4/SUPDRV.h:88,
from /tmp/vbox.4/linux/SUPDrv-linux.c:22:
include/linux/wait.h:26:25: error: asm/current.h: No such file or directory
In file included from include/linux/mmzone.h:14,
from include/linux/gfp.h:4,
from include/linux/slab.h:14,
from /tmp/vbox.4/SUPDRV.h:88,
from /tmp/vbox.4/linux/SUPDrv-linux.c:22:
include/linux/seqlock.h: In function ‘read_seqbegin’:
include/linux/seqlock.h:89: warning: implicit declaration of function ‘smp_rmb’
In file included from include/linux/nodemask.h:85,
from include/linux/mmzone.h:15,
from include/linux/gfp.h:4,
from include/linux/slab.h:14,
from /tmp/vbox.4/SUPDRV.h:88,
from /tmp/vbox.4/linux/SUPDrv-linux.c:22:
include/linux/bitmap.h: In function ‘bitmap_zero’:
include/linux/bitmap.h:134: error: ‘BITS_PER_LONG’ undeclared (first use in this function)
include/linux/bitmap.h:138: error: too many arguments to function ‘memset’
include/linux/bitmap.h: In function ‘bitmap_fill’:
include/linux/bitmap.h:144: error: ‘BITS_PER_LONG’ undeclared (first use in this function)
include/linux/bitmap.h:147: error: too many arguments to function ‘memset’
include/linux/bitmap.h: In function ‘bitmap_copy’:
include/linux/bitmap.h:155: error: ‘BITS_PER_LONG’ undeclared (first use in this function)
include/linux/bitmap.h:159: error: too many arguments to function ‘memcpy’
include/linux/bitmap.h: In function ‘bitmap_and’:
include/linux/bitmap.h:166: error: ‘BITS_PER_LONG’ undeclared (first use in this function)
include/linux/bitmap.h: In function ‘bitmap_or’:
include/linux/bitmap.h:175: error: ‘BITS_PER_LONG’ undeclared (first use in this function)
include/linux/bitmap.h: In function ‘bitmap_xor’:
include/linux/bitmap.h:184: error: ‘BITS_PER_LONG’ undeclared (first use in this function)
include/linux/bitmap.h: In function ‘bitmap_andnot’:
include/linux/bitmap.h:193: error: ‘BITS_PER_LONG’ undeclared (first use in this function)
include/linux/bitmap.h: In function ‘bitmap_complement’:
include/linux/bitmap.h:202: error: ‘BITS_PER_LONG’ undeclared (first use in this function)
include/linux/bitmap.h: In function ‘bitmap_equal’:
include/linux/bitmap.h:211: error: ‘BITS_PER_LONG’ undeclared (first use in this function)
include/linux/bitmap.h: In function ‘bitmap_intersects’:
include/linux/bitmap.h:220: error: ‘BITS_PER_LONG’ undeclared (first use in this function)
include/linux/bitmap.h: In function ‘bitmap_subset’:
include/linux/bitmap.h:229: error: ‘BITS_PER_LONG’ undeclared (first use in this function)
include/linux/bitmap.h: In function ‘bitmap_empty’:
include/linux/bitmap.h:237: error: ‘BITS_PER_LONG’ undeclared (first use in this function)
include/linux/bitmap.h: In function ‘bitmap_full’:
include/linux/bitmap.h:245: error: ‘BITS_PER_LONG’ undeclared (first use in this function)
include/linux/bitmap.h: In function ‘bitmap_weight’:
include/linux/bitmap.h:253: error: ‘BITS_PER_LONG’ undeclared (first use in this function)
include/linux/bitmap.h: In function ‘bitmap_shift_right’:
include/linux/bitmap.h:261: error: ‘BITS_PER_LONG’ undeclared (first use in this function)
include/linux/bitmap.h: In function ‘bitmap_shift_left’:
include/linux/bitmap.h:270: error: ‘BITS_PER_LONG’ undeclared (first use in this function)
In file included from include/linux/mmzone.h:15,
from include/linux/gfp.h:4,
from include/linux/slab.h:14,
from /tmp/vbox.4/SUPDRV.h:88,
from /tmp/vbox.4/linux/SUPDrv-linux.c:22:
include/linux/nodemask.h: At top level:
include/linux/nodemask.h:88: error: ‘BITS_PER_LONG’ undeclared here (not in a function)
include/linux/nodemask.h: In function ‘__first_node’:
include/linux/nodemask.h:229: warning: implicit declaration of function ‘find_first_bit’
include/linux/nodemask.h: In function ‘__next_node’:
include/linux/nodemask.h:235: warning: implicit declaration of function ‘find_next_bit’
include/linux/nodemask.h: In function ‘__first_unset_node’:
include/linux/nodemask.h:253: warning: implicit declaration of function ‘find_first_zero_bit’
In file included from include/linux/mmzone.h:15,
from include/linux/gfp.h:4,
from include/linux/slab.h:14,
from /tmp/vbox.4/SUPDRV.h:88,
from /tmp/vbox.4/linux/SUPDrv-linux.c:22:
include/linux/nodemask.h:259:21: warning: "BITS_PER_LONG" is not defined
In file included from include/linux/gfp.h:4,
from include/linux/slab.h:14,
from /tmp/vbox.4/SUPDRV.h:88,
from /tmp/vbox.4/linux/SUPDrv-linux.c:22:
include/linux/mmzone.h:17:22: error: asm/page.h: No such file or directory
In file included from include/linux/gfp.h:4,
from include/linux/slab.h:14,
from /tmp/vbox.4/SUPDRV.h:88,
from /tmp/vbox.4/linux/SUPDrv-linux.c:22:
include/linux/mmzone.h: At top level:
include/linux/mmzone.h:229: error: expected specifier-qualifier-list before ‘atomic_t’
In file included from include/linux/notifier.h:12,
from include/linux/memory_hotplug.h:7,
from include/linux/mmzone.h:466,
from include/linux/gfp.h:4,
from include/linux/slab.h:14,
from /tmp/vbox.4/SUPDRV.h:88,
from /tmp/vbox.4/linux/SUPDrv-linux.c:22:
include/linux/errno.h:4:23: error: asm/errno.h: No such file or directory
In file included from include/linux/notifier.h:13,
from include/linux/memory_hotplug.h:7,
from include/linux/mmzone.h:466,
from include/linux/gfp.h:4,
from include/linux/slab.h:14,
from /tmp/vbox.4/SUPDRV.h:88,
from /tmp/vbox.4/linux/SUPDrv-linux.c:22:
include/linux/mutex.h:49: error: expected specifier-qualifier-list before ‘atomic_t’
include/linux/mutex.h: In function ‘mutex_is_locked’:
include/linux/mutex.h:116: warning: implicit declaration of function ‘atomic_read’
include/linux/mutex.h:116: error: ‘struct mutex’ has no member named ‘count’
In file included from include/linux/notifier.h:14,
from include/linux/memory_hotplug.h:7,
from include/linux/mmzone.h:466,
from include/linux/gfp.h:4,
from include/linux/slab.h:14,
from /tmp/vbox.4/SUPDRV.h:88,
from /tmp/vbox.4/linux/SUPDrv-linux.c:22:
include/linux/rwsem.h:24:65: error: asm/rwsem.h: No such file or directory
In file included from include/linux/memory_hotplug.h:7,
from include/linux/mmzone.h:466,
from include/linux/gfp.h:4,
from include/linux/slab.h:14,
from /tmp/vbox.4/SUPDRV.h:88,
from /tmp/vbox.4/linux/SUPDrv-linux.c:22:
include/linux/notifier.h: At top level:
include/linux/notifier.h:62: error: field ‘rwsem’ has incomplete type
In file included from include/linux/mmzone.h:466,
from include/linux/gfp.h:4,
from include/linux/slab.h:14,
from /tmp/vbox.4/SUPDRV.h:88,
from /tmp/vbox.4/linux/SUPDrv-linux.c:22:
include/linux/memory_hotplug.h: In function ‘mhp_notimplemented’:
include/linux/memory_hotplug.h:160: error: ‘ENOSYS’ undeclared (first use in this function)
include/linux/memory_hotplug.h: In function ‘__remove_pages’:
include/linux/memory_hotplug.h:169: error: ‘ENOSYS’ undeclared (first use in this function)
include/linux/memory_hotplug.h: At top level:
include/linux/memory_hotplug.h:172: error: expected declaration specifiers or ‘...’ before ‘u64’
include/linux/memory_hotplug.h:172: error: expected declaration specifiers or ‘...’ before ‘u64’
include/linux/memory_hotplug.h:173: error: expected declaration specifiers or ‘...’ before ‘u64’
include/linux/memory_hotplug.h:173: error: expected declaration specifiers or ‘...’ before ‘u64’
include/linux/memory_hotplug.h:174: error: expected ‘)’ before ‘start’
In file included from include/linux/gfp.h:4,
from include/linux/slab.h:14,
from /tmp/vbox.4/SUPDRV.h:88,
from /tmp/vbox.4/linux/SUPDrv-linux.c:22:
include/linux/mmzone.h: In function ‘populated_zone’:
include/linux/mmzone.h:499: error: ‘struct zone’ has no member named ‘present_pages’
include/linux/mmzone.h: In function ‘is_normal’:
include/linux/mmzone.h:533: error: ‘struct zone’ has no member named ‘zone_pgdat’
include/linux/mmzone.h: At top level:
include/linux/mmzone.h:558: error: expected declaration specifiers or ‘...’ before ‘loff_t’
include/linux/mmzone.h:561: error: expected declaration specifiers or ‘...’ before ‘loff_t’
include/linux/mmzone.h:563: error: expected declaration specifiers or ‘...’ before ‘loff_t’
include/linux/mmzone.h:565: error: expected declaration specifiers or ‘...’ before ‘loff_t’
include/linux/mmzone.h:567: error: expected declaration specifiers or ‘...’ before ‘loff_t’
In file included from include/linux/topology.h:30,
from include/linux/mmzone.h:569,
from include/linux/gfp.h:4,
from include/linux/slab.h:14,
from /tmp/vbox.4/SUPDRV.h:88,
from /tmp/vbox.4/linux/SUPDrv-linux.c:22:
include/linux/cpumask.h:239:16: warning: "BITS_PER_LONG" is not defined
In file included from include/linux/topology.h:33,
from include/linux/mmzone.h:569,
from include/linux/gfp.h:4,
from include/linux/slab.h:14,
from /tmp/vbox.4/SUPDRV.h:88,
from /tmp/vbox.4/linux/SUPDrv-linux.c:22:
include/linux/smp.h: In function ‘smp_call_function_single’:
include/linux/smp.h:105: error: ‘EBUSY’ undeclared (first use in this function)
In file included from include/linux/mmzone.h:569,
from include/linux/gfp.h:4,
from include/linux/slab.h:14,
from /tmp/vbox.4/SUPDRV.h:88,
from /tmp/vbox.4/linux/SUPDrv-linux.c:22:
include/linux/topology.h:34:26: error: asm/topology.h: No such file or directory
In file included from include/linux/gfp.h:4,
from include/linux/slab.h:14,
from /tmp/vbox.4/SUPDRV.h:88,
from /tmp/vbox.4/linux/SUPDrv-linux.c:22:
include/linux/mmzone.h:616:5: warning: "BITS_PER_LONG" is not defined
include/linux/mmzone.h:623:7: warning: "BITS_PER_LONG" is not defined
include/linux/mmzone.h:631:2: error: #error BITS_PER_LONG not defined
In file included from include/linux/slab.h:14,
from /tmp/vbox.4/SUPDRV.h:88,
from /tmp/vbox.4/linux/SUPDrv-linux.c:22:
include/linux/gfp.h: In function ‘alloc_pages_node’:
include/linux/gfp.h:135: warning: implicit declaration of function ‘cpu_to_node’
In file included from /tmp/vbox.4/linux/SUPDrv-linux.c:22:
/tmp/vbox.4/SUPDRV.h:89:30: error: asm/semaphore.h: No such file or directory
In file included from include/linux/ktime.h:24,
from include/linux/timer.h:5,
from /tmp/vbox.4/SUPDRV.h:90,
from /tmp/vbox.4/linux/SUPDrv-linux.c:22:
include/linux/time.h: At top level:
include/linux/time.h:13: error: expected specifier-qualifier-list before ‘time_t’
include/linux/time.h:19: error: expected specifier-qualifier-list before ‘time_t’
include/linux/time.h: In function ‘timespec_equal’:
include/linux/time.h:41: error: ‘struct timespec’ has no member named ‘tv_sec’
include/linux/time.h:41: error: ‘struct timespec’ has no member named ‘tv_sec’
include/linux/time.h:41: error: ‘struct timespec’ has no member named ‘tv_nsec’
include/linux/time.h:41: error: ‘struct timespec’ has no member named ‘tv_nsec’
include/linux/time.h: In function ‘timespec_compare’:
include/linux/time.h:51: error: ‘const struct timespec’ has no member named ‘tv_sec’
include/linux/time.h:51: error: ‘const struct timespec’ has no member named ‘tv_sec’
include/linux/time.h:53: error: ‘const struct timespec’ has no member named ‘tv_sec’
include/linux/time.h:53: error: ‘const struct timespec’ has no member named ‘tv_sec’
include/linux/time.h:55: error: ‘const struct timespec’ has no member named ‘tv_nsec’
include/linux/time.h:55: error: ‘const struct timespec’ has no member named ‘tv_nsec’
include/linux/time.h: In function ‘timeval_compare’:
include/linux/time.h:60: error: ‘const struct timeval’ has no member named ‘tv_sec’
include/linux/time.h:60: error: ‘const struct timeval’ has no member named ‘tv_sec’
include/linux/time.h:62: error: ‘const struct timeval’ has no member named ‘tv_sec’
include/linux/time.h:62: error: ‘const struct timeval’ has no member named ‘tv_sec’
include/linux/time.h:64: error: ‘const struct timeval’ has no member named ‘tv_usec’
include/linux/time.h:64: error: ‘const struct timeval’ has no member named ‘tv_usec’
include/linux/time.h: At top level:
include/linux/time.h:71: error: expected declaration specifiers or ‘...’ before ‘time_t’
include/linux/time.h: In function ‘timespec_sub’:
include/linux/time.h:80: error: ‘struct timespec’ has no member named ‘tv_sec’
include/linux/time.h:80: error: ‘struct timespec’ has no member named ‘tv_sec’
include/linux/time.h:81: error: ‘struct timespec’ has no member named ‘tv_nsec’
include/linux/time.h:81: error: ‘struct timespec’ has no member named ‘tv_nsec’
include/linux/time.h:81: error: too many arguments to function ‘set_normalized_timespec’
include/linux/time.h: In function ‘get_seconds’:
include/linux/time.h:100: error: ‘struct timespec’ has no member named ‘tv_sec’
include/linux/time.h: At top level:
include/linux/time.h:131: error: expected ‘=’, ‘,’, ‘;’, ‘asm’ or ‘__attribute__’ before ‘timespec_to_ns’
include/linux/time.h:143: error: expected ‘=’, ‘,’, ‘;’, ‘asm’ or ‘__attribute__’ before ‘timeval_to_ns’
include/linux/time.h:155: warning: type defaults to ‘int’ in declaration of ‘s64’
include/linux/time.h:155: error: expected ‘;’, ‘,’ or ‘)’ before ‘nsec’
include/linux/time.h:163: warning: type defaults to ‘int’ in declaration of ‘s64’
include/linux/time.h:163: error: expected ‘;’, ‘,’ or ‘)’ before ‘nsec’
include/linux/time.h:170: error: expected declaration specifiers or ‘...’ before ‘u64’
include/linux/time.h: In function ‘timespec_add_ns’:
include/linux/time.h:172: error: ‘ns’ undeclared (first use in this function)
include/linux/time.h:172: error: ‘struct timespec’ has no member named ‘tv_nsec’
include/linux/time.h:175: error: ‘struct timespec’ has no member named ‘tv_sec’
include/linux/time.h:177: error: ‘struct timespec’ has no member named ‘tv_nsec’
In file included from include/linux/jiffies.h:4,
from include/linux/ktime.h:25,
from include/linux/timer.h:5,
from /tmp/vbox.4/SUPDRV.h:90,
from /tmp/vbox.4/linux/SUPDrv-linux.c:22:
include/linux/calc64.h:5:23: error: asm/div64.h: No such file or directory
In file included from include/linux/jiffies.h:4,
from include/linux/ktime.h:25,
from include/linux/timer.h:5,
from /tmp/vbox.4/SUPDRV.h:90,
from /tmp/vbox.4/linux/SUPDrv-linux.c:22:
include/linux/calc64.h: In function ‘do_div_llr’:
include/linux/calc64.h:23: error: ‘u64’ undeclared (first use in this function)
include/linux/calc64.h:23: error: expected ‘;’ before ‘result’
include/linux/calc64.h:25: warning: implicit declaration of function ‘do_div’
include/linux/calc64.h:25: error: ‘result’ undeclared (first use in this function)
In file included from include/linux/jiffies.h:8,
from include/linux/ktime.h:25,
from include/linux/timer.h:5,
from /tmp/vbox.4/SUPDRV.h:90,
from /tmp/vbox.4/linux/SUPDrv-linux.c:22:
include/linux/timex.h:59:23: error: asm/param.h: No such file or directory
include/linux/timex.h:187:23: error: asm/timex.h: No such file or directory
In file included from include/linux/jiffies.h:8,
from include/linux/ktime.h:25,
from include/linux/timer.h:5,
from /tmp/vbox.4/SUPDRV.h:90,
from /tmp/vbox.4/linux/SUPDrv-linux.c:22:
include/linux/timex.h: At top level:
include/linux/timex.h:297: error: expected ‘=’, ‘,’, ‘;’, ‘asm’ or ‘__attribute__’ before ‘current_tick_length’
In file included from include/linux/ktime.h:25,
from include/linux/timer.h:5,
from /tmp/vbox.4/SUPDRV.h:90,
from /tmp/vbox.4/linux/SUPDrv-linux.c:22:
include/linux/jiffies.h:18:5: warning: "HZ" is not defined
include/linux/jiffies.h:20:7: warning: "HZ" is not defined
include/linux/jiffies.h:22:7: warning: "HZ" is not defined
include/linux/jiffies.h:24:7: warning: "HZ" is not defined
include/linux/jiffies.h:26:7: warning: "HZ" is not defined
include/linux/jiffies.h:28:7: warning: "HZ" is not defined
include/linux/jiffies.h:30:7: warning: "HZ" is not defined
include/linux/jiffies.h:33:3: error: #error You lose.
In file included from include/linux/ktime.h:25,
from include/linux/timer.h:5,
from /tmp/vbox.4/SUPDRV.h:90,
from /tmp/vbox.4/linux/SUPDrv-linux.c:22:
include/linux/jiffies.h:81: warning: type defaults to ‘int’ in declaration of ‘u64’
include/linux/jiffies.h:81: error: expected ‘,’ or ‘;’ before ‘jiffies_64’
include/linux/jiffies.h:84:6: warning: "BITS_PER_LONG" is not defined
include/linux/jiffies.h:85: error: expected ‘=’, ‘,’, ‘;’, ‘asm’ or ‘__attribute__’ before ‘get_jiffies_64’
include/linux/jiffies.h:225:31: warning: "CLOCK_TICK_RATE" is not defined
include/linux/jiffies.h:225:31: warning: "CLOCK_TICK_RATE" is not defined
include/linux/jiffies.h:225:31: warning: "HZ" is not defined
include/linux/jiffies.h:225:31: warning: "HZ" is not defined
include/linux/jiffies.h:225:31: error: division by zero in #if
include/linux/jiffies.h:225:31: error: division by zero in #if
include/linux/jiffies.h:225:31: warning: "CLOCK_TICK_RATE" is not defined
include/linux/jiffies.h:225:31: warning: "CLOCK_TICK_RATE" is not defined
include/linux/jiffies.h:225:31: warning: "HZ" is not defined
include/linux/jiffies.h:225:31: warning: "HZ" is not defined
include/linux/jiffies.h:225:31: error: division by zero in #if
include/linux/jiffies.h:225:31: error: division by zero in #if
include/linux/jiffies.h:225:31: warning: "CLOCK_TICK_RATE" is not defined
include/linux/jiffies.h:225:31: warning: "HZ" is not defined
include/linux/jiffies.h:225:31: warning: "HZ" is not defined
include/linux/jiffies.h:225:31: error: division by zero in #if
include/linux/jiffies.h:225:31: warning: "CLOCK_TICK_RATE" is not defined
include/linux/jiffies.h:225:31: warning: "HZ" is not defined
include/linux/jiffies.h:225:31: warning: "HZ" is not defined
include/linux/jiffies.h:225:31: error: division by zero in #if
include/linux/jiffies.h:225:31: error: division by zero in #if
include/linux/jiffies.h:225:31: error: division by zero in #if
include/linux/jiffies.h:225:31: warning: "CLOCK_TICK_RATE" is not defined
include/linux/jiffies.h:225:31: warning: "CLOCK_TICK_RATE" is not defined
include/linux/jiffies.h:225:31: warning: "HZ" is not defined
include/linux/jiffies.h:225:31: warning: "HZ" is not defined
include/linux/jiffies.h:225:31: error: division by zero in #if
include/linux/jiffies.h:225:31: error: division by zero in #if
include/linux/jiffies.h:225:31: warning: "CLOCK_TICK_RATE" is not defined
include/linux/jiffies.h:225:31: warning: "CLOCK_TICK_RATE" is not defined
include/linux/jiffies.h:225:31: warning: "HZ" is not defined
include/linux/jiffies.h:225:31: warning: "HZ" is not defined
include/linux/jiffies.h:225:31: error: division by zero in #if
include/linux/jiffies.h:225:31: error: division by zero in #if
include/linux/jiffies.h:225:31: warning: "CLOCK_TICK_RATE" is not defined
include/linux/jiffies.h:225:31: warning: "HZ" is not defined
include/linux/jiffies.h:225:31: warning: "HZ" is not defined
include/linux/jiffies.h:225:31: error: division by zero in #if
include/linux/jiffies.h:225:31: warning: "CLOCK_TICK_RATE" is not defined
include/linux/jiffies.h:225:31: warning: "HZ" is not defined
include/linux/jiffies.h:225:31: warning: "HZ" is not defined
include/linux/jiffies.h:225:31: error: division by zero in #if
include/linux/jiffies.h:225:31: error: division by zero in #if
include/linux/jiffies.h:225:31: error: division by zero in #if
include/linux/jiffies.h:225:31: warning: "CLOCK_TICK_RATE" is not defined
include/linux/jiffies.h:225:31: warning: "CLOCK_TICK_RATE" is not defined
include/linux/jiffies.h:225:31: warning: "HZ" is not defined
include/linux/jiffies.h:225:31: warning: "HZ" is not defined
include/linux/jiffies.h:225:31: error: division by zero in #if
include/linux/jiffies.h:225:31: error: division by zero in #if
include/linux/jiffies.h:225:31: warning: "CLOCK_TICK_RATE" is not defined
include/linux/jiffies.h:225:31: warning: "CLOCK_TICK_RATE" is not defined
include/linux/jiffies.h:225:31: warning: "HZ" is not defined
include/linux/jiffies.h:225:31: warning: "HZ" is not defined
include/linux/jiffies.h:225:31: error: division by zero in #if
include/linux/jiffies.h:225:31: error: division by zero in #if
include/linux/jiffies.h:225:31: warning: "CLOCK_TICK_RATE" is not defined
include/linux/jiffies.h:225:31: warning: "HZ" is not defined
include/linux/jiffies.h:225:31: warning: "HZ" is not defined
include/linux/jiffies.h:225:31: error: division by zero in #if
include/linux/jiffies.h:225:31: warning: "CLOCK_TICK_RATE" is not defined
include/linux/jiffies.h:225:31: warning: "HZ" is not defined
include/linux/jiffies.h:225:31: warning: "HZ" is not defined
include/linux/jiffies.h:225:31: error: division by zero in #if
include/linux/jiffies.h:225:31: error: division by zero in #if
include/linux/jiffies.h:225:31: warning: "CLOCK_TICK_RATE" is not defined
include/linux/jiffies.h:225:31: warning: "CLOCK_TICK_RATE" is not defined
include/linux/jiffies.h:225:31: warning: "HZ" is not defined
include/linux/jiffies.h:225:31: warning: "HZ" is not defined
include/linux/jiffies.h:225:31: error: division by zero in #if
include/linux/jiffies.h:225:31: error: division by zero in #if
include/linux/jiffies.h:225:31: warning: "CLOCK_TICK_RATE" is not defined
include/linux/jiffies.h:225:31: warning: "CLOCK_TICK_RATE" is not defined
include/linux/jiffies.h:225:31: warning: "HZ" is not defined
include/linux/jiffies.h:225:31: warning: "HZ" is not defined
include/linux/jiffies.h:225:31: error: division by zero in #if
include/linux/jiffies.h:225:31: error: division by zero in #if
include/linux/jiffies.h:225:31: warning: "CLOCK_TICK_RATE" is not defined
include/linux/jiffies.h:225:31: warning: "HZ" is not defined
include/linux/jiffies.h:225:31: warning: "HZ" is not defined
include/linux/jiffies.h:225:31: error: division by zero in #if
include/linux/jiffies.h:225:31: warning: "CLOCK_TICK_RATE" is not defined
include/linux/jiffies.h:225:31: warning: "HZ" is not defined
include/linux/jiffies.h:225:31: warning: "HZ" is not defined
include/linux/jiffies.h:225:31: error: division by zero in #if
include/linux/jiffies.h:225:31: error: division by zero in #if
include/linux/jiffies.h:225:31: error: division by zero in #if
include/linux/jiffies.h:225:46: warning: "SHIFT_HZ" is not defined
include/linux/jiffies.h:252:5: warning: "BITS_PER_LONG" is not defined
include/linux/jiffies.h:274: error: expected ‘=’, ‘,’, ‘;’, ‘asm’ or ‘__attribute__’ before ‘jiffies_to_clock_t’
include/linux/jiffies.h:276: error: expected ‘=’, ‘,’, ‘;’, ‘asm’ or ‘__attribute__’ before ‘jiffies_64_to_clock_t’
include/linux/jiffies.h:277: error: expected ‘=’, ‘,’, ‘;’, ‘asm’ or ‘__attribute__’ before ‘nsec_to_clock_t’
In file included from include/linux/timer.h:5,
from /tmp/vbox.4/SUPDRV.h:90,
from /tmp/vbox.4/linux/SUPDrv-linux.c:22:
include/linux/ktime.h:47: error: expected specifier-qualifier-list before ‘s64’
In file included from include/linux/timer.h:5,
from /tmp/vbox.4/SUPDRV.h:90,
from /tmp/vbox.4/linux/SUPDrv-linux.c:22:
include/linux/ktime.h:48:5: warning: "BITS_PER_LONG" is not defined
include/linux/ktime.h:62:6: warning: "BITS_PER_LONG" is not defined
include/linux/ktime.h:72:6: warning: "BITS_PER_LONG" is not defined
include/linux/ktime.h: In function ‘ktime_set’:
include/linux/ktime.h:146: error: unknown field ‘tv’ specified in initializer
include/linux/ktime.h:146: error: extra brace group at end of initializer
include/linux/ktime.h:146: error: (near initialization for ‘(anonymous)’)
include/linux/ktime.h:146: warning: excess elements in union initializer
include/linux/ktime.h:146: warning: (near initialization for ‘(anonymous)’)
include/linux/ktime.h: In function ‘ktime_sub’:
include/linux/ktime.h:160: error: ‘ktime_t’ has no member named ‘tv64’
include/linux/ktime.h:160: error: ‘ktime_t’ has no member named ‘tv64’
include/linux/ktime.h:160: error: ‘ktime_t’ has no member named ‘tv64’
include/linux/ktime.h:161: error: ‘ktime_t’ has no member named ‘tv’
include/linux/ktime.h:162: error: ‘ktime_t’ has no member named ‘tv’
include/linux/ktime.h: In function ‘ktime_add’:
include/linux/ktime.h:178: error: ‘ktime_t’ has no member named ‘tv64’
include/linux/ktime.h:178: error: ‘ktime_t’ has no member named ‘tv64’
include/linux/ktime.h:178: error: ‘ktime_t’ has no member named ‘tv64’
include/linux/ktime.h:187: error: ‘ktime_t’ has no member named ‘tv’
include/linux/ktime.h:188: error: ‘ktime_t’ has no member named ‘tv64’
include/linux/ktime.h:188: error: ‘u32’ undeclared (first use in this function)
include/linux/ktime.h: At top level:
include/linux/ktime.h:200: error: expected declaration specifiers or ‘...’ before ‘u64’
include/linux/ktime.h: In function ‘timespec_to_ktime’:
include/linux/ktime.h:210: error: unknown field ‘tv’ specified in initializer
include/linux/ktime.h:210: error: extra brace group at end of initializer
include/linux/ktime.h:210: error: (near initialization for ‘(anonymous)’)
include/linux/ktime.h:210: error: ‘s32’ undeclared (first use in this function)
include/linux/ktime.h:210: error: expected ‘}’ before ‘ts’
include/linux/ktime.h: In function ‘timeval_to_ktime’:
include/linux/ktime.h:222: error: unknown field ‘tv’ specified in initializer
include/linux/ktime.h:222: error: extra brace group at end of initializer
include/linux/ktime.h:222: error: (near initialization for ‘(anonymous)’)
include/linux/ktime.h:222: error: ‘s32’ undeclared (first use in this function)
include/linux/ktime.h:222: error: expected ‘}’ before ‘tv’
include/linux/ktime.h: In function ‘ktime_to_timespec’:
include/linux/ktime.h:234: error: unknown field ‘tv_sec’ specified in initializer
include/linux/ktime.h:234: error: ‘time_t’ undeclared (first use in this function)
include/linux/ktime.h:234: warning: excess elements in struct initializer
include/linux/ktime.h:234: warning: (near initialization for ‘(anonymous)’)
include/linux/ktime.h:234: error: expected ‘}’ before ‘kt’
include/linux/ktime.h: In function ‘ktime_to_timeval’:
include/linux/ktime.h:247: error: unknown field ‘tv_sec’ specified in initializer
include/linux/ktime.h:247: error: ‘time_t’ undeclared (first use in this function)
include/linux/ktime.h:247: warning: excess elements in struct initializer
include/linux/ktime.h:247: warning: (near initialization for ‘(anonymous)’)
include/linux/ktime.h:247: error: expected ‘}’ before ‘kt’
include/linux/ktime.h: At top level:
include/linux/ktime.h:257: error: expected ‘=’, ‘,’, ‘;’, ‘asm’ or ‘__attribute__’ before ‘ktime_to_ns’
include/linux/ktime.h: In function ‘ktime_equal’:
include/linux/ktime.h:273: error: ‘ktime_t’ has no member named ‘tv64’
include/linux/ktime.h:273: error: ‘ktime_t’ has no member named ‘tv64’
include/linux/ktime.h: At top level:
include/linux/ktime.h:276: error: expected ‘=’, ‘,’, ‘;’, ‘asm’ or ‘__attribute__’ before ‘ktime_to_us’
In file included from /tmp/vbox.4/SUPDRV.h:90,
from /tmp/vbox.4/linux/SUPDrv-linux.c:22:
include/linux/timer.h: In function ‘add_timer’:
include/linux/timer.h:153: warning: implicit declaration of function ‘BUG_ON’
In file included from /tmp/vbox.4/SUPDRV.h:115,
from /tmp/vbox.4/linux/SUPDrv-linux.c:22:
/tmp/vbox.4/SUPDRVIOC.h: At top level:
/tmp/vbox.4/SUPDRVIOC.h:189: error: expected specifier-qualifier-list before ‘uint32_t’
/tmp/vbox.4/SUPDRVIOC.h:198: error: expected specifier-qualifier-list before ‘uint32_t’
/tmp/vbox.4/SUPDRVIOC.h:217: error: expected specifier-qualifier-list before ‘uint32_t’
/tmp/vbox.4/SUPDRVIOC.h:235: error: expected specifier-qualifier-list before ‘uint32_t’
/tmp/vbox.4/SUPDRVIOC.h:246: error: expected specifier-qualifier-list before ‘uint32_t’
/tmp/vbox.4/SUPDRVIOC.h:255: error: expected specifier-qualifier-list before ‘uint8_t’
/tmp/vbox.4/SUPDRVIOC.h:264: error: expected specifier-qualifier-list before ‘uint32_t’
/tmp/vbox.4/SUPDRVIOC.h:275: error: expected specifier-qualifier-list before ‘uint32_t’
/tmp/vbox.4/SUPDRVIOC.h:297: error: expected specifier-qualifier-list before ‘uint32_t’
/tmp/vbox.4/SUPDRVIOC.h:310: error: expected specifier-qualifier-list before ‘uint32_t’
/tmp/vbox.4/SUPDRVIOC.h:325: error: expected specifier-qualifier-list before ‘RTR3PTR’
/tmp/vbox.4/SUPDRVIOC.h:336: error: expected specifier-qualifier-list before ‘uint32_t’
/tmp/vbox.4/SUPDRVIOC.h:349: error: expected specifier-qualifier-list before ‘uint32_t’
/tmp/vbox.4/SUPDRVIOC.h:396: error: expected specifier-qualifier-list before ‘uint32_t’
/tmp/vbox.4/SUPDRVIOC.h:405: error: expected specifier-qualifier-list before ‘uint32_t’
/tmp/vbox.4/SUPDRVIOC.h:448: error: expected specifier-qualifier-list before ‘uint32_t’
/tmp/vbox.4/SUPDRVIOC.h:461: error: expected specifier-qualifier-list before ‘uint32_t’
/tmp/vbox.4/SUPDRVIOC.h:483: error: expected specifier-qualifier-list before ‘uint32_t’
/tmp/vbox.4/SUPDRVIOC.h:500: error: expected specifier-qualifier-list before ‘int32_t’
/tmp/vbox.4/SUPDRVIOC.h:509: error: expected specifier-qualifier-list before ‘uint32_t’
/tmp/vbox.4/SUPDRVIOC.h:527: error: expected specifier-qualifier-list before ‘uint32_t’
/tmp/vbox.4/SUPDRVIOC.h:538: error: expected specifier-qualifier-list before ‘RTR3PTR’
/tmp/vbox.4/SUPDRVIOC.h:551: error: expected specifier-qualifier-list before ‘uint32_t’
/tmp/vbox.4/SUPDRVIOC.h:564: error: expected specifier-qualifier-list before ‘uint32_t’
/tmp/vbox.4/SUPDRVIOC.h:573: error: expected specifier-qualifier-list before ‘RTHCUINTPTR’
/tmp/vbox.4/SUPDRVIOC.h:586: error: expected specifier-qualifier-list before ‘uint32_t’
/tmp/vbox.4/SUPDRVIOC.h:597: error: expected specifier-qualifier-list before ‘uint32_t’
/tmp/vbox.4/SUPDRVIOC.h:610: error: expected specifier-qualifier-list before ‘uint32_t’
/tmp/vbox.4/SUPDRVIOC.h:621: error: expected specifier-qualifier-list before ‘RTR3PTR’
/tmp/vbox.4/SUPDRVIOC.h:632: error: expected specifier-qualifier-list before ‘uint32_t’
In file included from /tmp/vbox.4/linux/SUPDrv-linux.c:22:
/tmp/vbox.4/SUPDRV.h:155:5: warning: "LINUX_VERSION_CODE" is not defined
/tmp/vbox.4/SUPDRV.h:155:26: warning: "KERNEL_VERSION" is not defined
/tmp/vbox.4/SUPDRV.h:155:40: error: missing binary operator before token "("
In file included from /tmp/vbox.4/linux/SUPDrv-linux.c:22:
/tmp/vbox.4/SUPDRV.h:474: error: expected specifier-qualifier-list before ‘uint32_t’
/tmp/vbox.4/SUPDRV.h:492: error: expected specifier-qualifier-list before ‘uint32_t’
/tmp/vbox.4/SUPDRV.h:518: error: expected specifier-qualifier-list before ‘uint32_t’
/tmp/vbox.4/SUPDRV.h:529: error: expected specifier-qualifier-list before ‘uint32_t’
/tmp/vbox.4/SUPDRV.h:563: error: expected specifier-qualifier-list before ‘uint32_t’
/tmp/vbox.4/SUPDRV.h:576: error: expected specifier-qualifier-list before ‘uint32_t’
/tmp/vbox.4/SUPDRV.h:648: error: expected specifier-qualifier-list before ‘uint32_t’
/tmp/vbox.4/SUPDRV.h:764: error: expected declaration specifiers or ‘...’ before ‘RTHCPHYS’
/tmp/vbox.4/SUPDRV.h:764: error: expected declaration specifiers or ‘...’ before ‘uint64_t’
/tmp/vbox.4/SUPDRV.h:766: error: expected declaration specifiers or ‘...’ before ‘uint64_t’
/tmp/vbox.4/SUPDRV.h:767: error: expected declaration specifiers or ‘...’ before ‘uint64_t’
In file included from /tmp/vbox.4/linux/SUPDrv-linux.c:23:
/tmp/vbox.4/r0drv/linux/the-linux-kernel.h:32:5: warning: "LINUX_VERSION_CODE" is not defined
/tmp/vbox.4/r0drv/linux/the-linux-kernel.h:32:26: warning: "KERNEL_VERSION" is not defined
/tmp/vbox.4/r0drv/linux/the-linux-kernel.h:32:40: error: missing binary operator before token "("
/tmp/vbox.4/r0drv/linux/the-linux-kernel.h:35:5: warning: "LINUX_VERSION_CODE" is not defined
/tmp/vbox.4/r0drv/linux/the-linux-kernel.h:35:27: warning: "KERNEL_VERSION" is not defined
/tmp/vbox.4/r0drv/linux/the-linux-kernel.h:35:41: error: missing binary operator before token "("
In file included from include/linux/module.h:11,
from /tmp/vbox.4/r0drv/linux/the-linux-kernel.h:56,
from /tmp/vbox.4/linux/SUPDrv-linux.c:23:
include/linux/stat.h:6:22: error: asm/stat.h: No such file or directory
In file included from include/linux/module.h:11,
from /tmp/vbox.4/r0drv/linux/the-linux-kernel.h:56,
from /tmp/vbox.4/linux/SUPDrv-linux.c:23:
include/linux/stat.h:63: error: expected specifier-qualifier-list before ‘u64’
In file included from include/linux/module.h:14,
from /tmp/vbox.4/r0drv/linux/the-linux-kernel.h:56,
from /tmp/vbox.4/linux/SUPDrv-linux.c:23:
include/linux/kmod.h: In function ‘request_module’:
include/linux/kmod.h:33: error: ‘ENOSYS’ undeclared (first use in this function)
In file included from include/linux/elf.h:5,
from include/linux/module.h:15,
from /tmp/vbox.4/r0drv/linux/the-linux-kernel.h:56,
from /tmp/vbox.4/linux/SUPDrv-linux.c:23:
include/linux/auxvec.h:4:24: error: asm/auxvec.h: No such file or directory
In file included from include/linux/module.h:15,
from /tmp/vbox.4/r0drv/linux/the-linux-kernel.h:56,
from /tmp/vbox.4/linux/SUPDrv-linux.c:23:
include/linux/elf.h:7:21: error: asm/elf.h: No such file or directory
In file included from include/linux/module.h:15,
from /tmp/vbox.4/r0drv/linux/the-linux-kernel.h:56,
from /tmp/vbox.4/linux/SUPDrv-linux.c:23:
include/linux/elf.h: At top level:
include/linux/elf.h:19: error: expected ‘=’, ‘,’, ‘;’, ‘asm’ or ‘__attribute__’ before ‘Elf32_Addr’
include/linux/elf.h:20: error: expected ‘=’, ‘,’, ‘;’, ‘asm’ or ‘__attribute__’ before ‘Elf32_Half’
include/linux/elf.h:21: error: expected ‘=’, ‘,’, ‘;’, ‘asm’ or ‘__attribute__’ before ‘Elf32_Off’
include/linux/elf.h:22: error: expected ‘=’, ‘,’, ‘;’, ‘asm’ or ‘__attribute__’ before ‘Elf32_Sword’
include/linux/elf.h:23: error: expected ‘=’, ‘,’, ‘;’, ‘asm’ or ‘__attribute__’ before ‘Elf32_Word’
include/linux/elf.h:26: error: expected ‘=’, ‘,’, ‘;’, ‘asm’ or ‘__attribute__’ before ‘Elf64_Addr’
include/linux/elf.h:27: error: expected ‘=’, ‘,’, ‘;’, ‘asm’ or ‘__attribute__’ before ‘Elf64_Half’
include/linux/elf.h:28: error: expected ‘=’, ‘,’, ‘;’, ‘asm’ or ‘__attribute__’ before ‘Elf64_SHalf’
include/linux/elf.h:29: error: expected ‘=’, ‘,’, ‘;’, ‘asm’ or ‘__attribute__’ before ‘Elf64_Off’
include/linux/elf.h:30: error: expected ‘=’, ‘,’, ‘;’, ‘asm’ or ‘__attribute__’ before ‘Elf64_Sword’
include/linux/elf.h:31: error: expected ‘=’, ‘,’, ‘;’, ‘asm’ or ‘__attribute__’ before ‘Elf64_Word’
include/linux/elf.h:32: error: expected ‘=’, ‘,’, ‘;’, ‘asm’ or ‘__attribute__’ before ‘Elf64_Xword’
include/linux/elf.h:33: error: expected ‘=’, ‘,’, ‘;’, ‘asm’ or ‘__attribute__’ before ‘Elf64_Sxword’
include/linux/elf.h:127: error: expected specifier-qualifier-list before ‘Elf32_Sword’
include/linux/elf.h:135: error: expected specifier-qualifier-list before ‘Elf64_Sxword’
include/linux/elf.h:150: error: expected specifier-qualifier-list before ‘Elf32_Addr’
include/linux/elf.h:155: error: expected specifier-qualifier-list before ‘Elf64_Addr’
include/linux/elf.h:160: error: expected specifier-qualifier-list before ‘Elf32_Addr’
include/linux/elf.h:166: error: expected specifier-qualifier-list before ‘Elf64_Addr’
include/linux/elf.h:172: error: expected specifier-qualifier-list before ‘Elf32_Word’
include/linux/elf.h:181: error: expected specifier-qualifier-list before ‘Elf64_Word’
include/linux/elf.h:194: error: expected specifier-qualifier-list before ‘Elf32_Half’
include/linux/elf.h:211: error: expected specifier-qualifier-list before ‘Elf64_Half’
include/linux/elf.h:233: error: expected specifier-qualifier-list before ‘Elf32_Word’
include/linux/elf.h:244: error: expected specifier-qualifier-list before ‘Elf64_Word’
include/linux/elf.h:289: error: expected specifier-qualifier-list before ‘Elf32_Word’
include/linux/elf.h:302: error: expected specifier-qualifier-list before ‘Elf64_Word’
include/linux/elf.h:362: error: expected specifier-qualifier-list before ‘Elf32_Word’
include/linux/elf.h:369: error: expected specifier-qualifier-list before ‘Elf64_Word’
include/linux/elf.h:374:5: warning: "ELF_CLASS" is not defined
In file included from include/linux/kobject.h:22,
from include/linux/module.h:17,
from /tmp/vbox.4/r0drv/linux/the-linux-kernel.h:56,
from /tmp/vbox.4/linux/SUPDrv-linux.c:23:
include/linux/sysfs.h:26: error: expected specifier-qualifier-list before ‘mode_t’
include/linux/sysfs.h:62: error: expected specifier-qualifier-list before ‘ssize_t’
include/linux/sysfs.h:69: error: expected specifier-qualifier-list before ‘ssize_t’
include/linux/sysfs.h: In function ‘sysfs_schedule_callback’:
include/linux/sysfs.h:142: error: ‘ENOSYS’ undeclared (first use in this function)
include/linux/sysfs.h: At top level:
include/linux/sysfs.h:176: error: expected declaration specifiers or ‘...’ before ‘mode_t’
In file included from include/linux/kobject.h:25,
from include/linux/module.h:17,
from /tmp/vbox.4/r0drv/linux/the-linux-kernel.h:56,
from /tmp/vbox.4/linux/SUPDrv-linux.c:23:
include/linux/kref.h:24: error: expected specifier-qualifier-list before ‘atomic_t’
In file included from include/linux/module.h:17,
from /tmp/vbox.4/r0drv/linux/the-linux-kernel.h:56,
from /tmp/vbox.4/linux/SUPDrv-linux.c:23:
include/linux/kobject.h:37: error: expected ‘=’, ‘,’, ‘;’, ‘asm’ or ‘__attribute__’ before ‘uevent_seqnum’
include/linux/kobject.h:254: error: expected specifier-qualifier-list before ‘ssize_t’
In file included from /tmp/vbox.4/r0drv/linux/the-linux-kernel.h:56,
from /tmp/vbox.4/linux/SUPDrv-linux.c:23:
include/linux/module.h:19:23: error: asm/local.h: No such file or directory
include/linux/module.h:21:24: error: asm/module.h: No such file or directory
In file included from /tmp/vbox.4/r0drv/linux/the-linux-kernel.h:56,
from /tmp/vbox.4/linux/SUPDrv-linux.c:23:
include/linux/module.h:49: error: expected specifier-qualifier-list before ‘ssize_t’
include/linux/module.h: In function ‘lookup_module_symbol_name’:
include/linux/module.h:535: error: ‘ERANGE’ undeclared (first use in this function)
include/linux/module.h: In function ‘lookup_module_symbol_attrs’:
include/linux/module.h:540: error: ‘ERANGE’ undeclared (first use in this function)
include/linux/module.h: In function ‘module_get_kallsym’:
include/linux/module.h:547: error: ‘ERANGE’ undeclared (first use in this function)
In file included from /tmp/vbox.4/linux/SUPDrv-linux.c:23:
/tmp/vbox.4/r0drv/linux/the-linux-kernel.h:57:5: warning: "LINUX_VERSION_CODE" is not defined
/tmp/vbox.4/r0drv/linux/the-linux-kernel.h:57:27: warning: "KERNEL_VERSION" is not defined
/tmp/vbox.4/r0drv/linux/the-linux-kernel.h:57:41: error: missing binary operator before token "("
In file included from include/linux/fs.h:10,
from /tmp/vbox.4/r0drv/linux/the-linux-kernel.h:62,
from /tmp/vbox.4/linux/SUPDrv-linux.c:23:
include/linux/ioctl.h:4:23: error: asm/ioctl.h: No such file or directory
In file included from include/linux/fs.h:274,
from /tmp/vbox.4/r0drv/linux/the-linux-kernel.h:62,
from /tmp/vbox.4/linux/SUPDrv-linux.c:23:
include/linux/kdev_t.h: At top level:
include/linux/kdev_t.h:21: error: expected ‘)’ before ‘dev’
include/linux/kdev_t.h:26: error: expected ‘=’, ‘,’, ‘;’, ‘asm’ or ‘__attribute__’ before ‘old_encode_dev’
include/linux/kdev_t.h:31: error: expected ‘=’, ‘,’, ‘;’, ‘asm’ or ‘__attribute__’ before ‘old_decode_dev’
include/linux/kdev_t.h:36: error: expected ‘)’ before ‘dev’
include/linux/kdev_t.h:41: error: expected ‘=’, ‘,’, ‘;’, ‘asm’ or ‘__attribute__’ before ‘new_encode_dev’
include/linux/kdev_t.h:48: error: expected ‘=’, ‘,’, ‘;’, ‘asm’ or ‘__attribute__’ before ‘new_decode_dev’
include/linux/kdev_t.h:55: error: expected ‘)’ before ‘dev’
include/linux/kdev_t.h:60: error: expected ‘=’, ‘,’, ‘;’, ‘asm’ or ‘__attribute__’ before ‘huge_encode_dev’
include/linux/kdev_t.h:65: error: expected ‘=’, ‘,’, ‘;’, ‘asm’ or ‘__attribute__’ before ‘huge_decode_dev’
include/linux/kdev_t.h:70: error: expected ‘)’ before ‘dev’
include/linux/kdev_t.h:75: error: expected ‘=’, ‘,’, ‘;’, ‘asm’ or ‘__attribute__’ before ‘sysv_encode_dev’
include/linux/kdev_t.h:80: error: expected ‘)’ before ‘dev’
include/linux/kdev_t.h:85: error: expected ‘)’ before ‘dev’
In file included from include/linux/rcupdate.h:41,
from include/linux/dcache.h:10,
from include/linux/fs.h:275,
from /tmp/vbox.4/r0drv/linux/the-linux-kernel.h:62,
from /tmp/vbox.4/linux/SUPDrv-linux.c:23:
include/linux/percpu.h:10:24: error: asm/percpu.h: No such file or directory
In file included from include/linux/dcache.h:10,
from include/linux/fs.h:275,
from /tmp/vbox.4/r0drv/linux/the-linux-kernel.h:62,
from /tmp/vbox.4/linux/SUPDrv-linux.c:23:
include/linux/rcupdate.h:113: error: expected declaration specifiers or ‘...’ before ‘rcu_data’
include/linux/rcupdate.h:113: warning: data definition has no type or storage class
include/linux/rcupdate.h:113: warning: type defaults to ‘int’ in declaration of ‘DECLARE_PER_CPU’
include/linux/rcupdate.h:114: error: expected declaration specifiers or ‘...’ before ‘rcu_bh_data’
include/linux/rcupdate.h:114: warning: data definition has no type or storage class
include/linux/rcupdate.h:114: warning: type defaults to ‘int’ in declaration of ‘DECLARE_PER_CPU’
include/linux/rcupdate.h: In function ‘rcu_qsctr_inc’:
include/linux/rcupdate.h:124: warning: implicit declaration of function ‘per_cpu’
include/linux/rcupdate.h:124: error: ‘rcu_data’ undeclared (first use in this function)
include/linux/rcupdate.h:124: error: lvalue required as unary ‘&’ operand
include/linux/rcupdate.h: In function ‘rcu_bh_qsctr_inc’:
include/linux/rcupdate.h:129: error: ‘rcu_bh_data’ undeclared (first use in this function)
include/linux/rcupdate.h:129: error: lvalue required as unary ‘&’ operand
In file included from include/linux/fs.h:275,
from /tmp/vbox.4/r0drv/linux/the-linux-kernel.h:62,
from /tmp/vbox.4/linux/SUPDrv-linux.c:23:
include/linux/dcache.h: At top level:
include/linux/dcache.h:83: error: expected specifier-qualifier-list before ‘atomic_t’
include/linux/dcache.h:135: warning: ‘struct inode’ declared inside parameter list
include/linux/dcache.h: In function ‘__d_drop’:
include/linux/dcache.h:200: error: ‘struct dentry’ has no member named ‘d_flags’
include/linux/dcache.h:201: error: ‘struct dentry’ has no member named ‘d_flags’
include/linux/dcache.h:202: error: ‘struct dentry’ has no member named ‘d_hash’
include/linux/dcache.h: In function ‘d_drop’:
include/linux/dcache.h:209: error: ‘struct dentry’ has no member named ‘d_lock’
include/linux/dcache.h:211: error: ‘struct dentry’ has no member named ‘d_lock’
include/linux/dcache.h: In function ‘dname_external’:
include/linux/dcache.h:217: error: ‘struct dentry’ has no member named ‘d_name’
include/linux/dcache.h:217: error: ‘struct dentry’ has no member named ‘d_iname’
include/linux/dcache.h: At top level:
include/linux/dcache.h:223: warning: ‘struct inode’ declared inside parameter list
include/linux/dcache.h:224: warning: ‘struct inode’ declared inside parameter list
include/linux/dcache.h:225: warning: ‘struct inode’ declared inside parameter list
include/linux/dcache.h:230: warning: ‘struct inode’ declared inside parameter list
include/linux/dcache.h:231: warning: ‘struct inode’ declared inside parameter list
include/linux/dcache.h:232: warning: ‘struct super_block’ declared inside parameter list
include/linux/dcache.h:234: warning: ‘struct super_block’ declared inside parameter list
include/linux/dcache.h:238: warning: ‘struct inode’ declared inside parameter list
include/linux/dcache.h:243: warning: ‘struct inode’ declared inside parameter list
include/linux/dcache.h:244: warning: ‘struct inode’ declared inside parameter list
include/linux/dcache.h:263: warning: ‘struct inode’ declared inside parameter list
include/linux/dcache.h: In function ‘d_add’:
include/linux/dcache.h:265: warning: passing argument 2 of ‘d_instantiate’ from incompatible pointer type
include/linux/dcache.h: At top level:
include/linux/dcache.h:277: warning: ‘struct inode’ declared inside parameter list
include/linux/dcache.h: In function ‘d_add_unique’:
include/linux/dcache.h:281: warning: passing argument 2 of ‘d_instantiate_unique’ from incompatible pointer type
include/linux/dcache.h: In function ‘dget’:
include/linux/dcache.h:324: error: ‘struct dentry’ has no member named ‘d_count’
include/linux/dcache.h:325: warning: implicit declaration of function ‘atomic_inc’
include/linux/dcache.h:325: error: ‘struct dentry’ has no member named ‘d_count’
include/linux/dcache.h: In function ‘d_unhashed’:
include/linux/dcache.h:341: error: ‘struct dentry’ has no member named ‘d_flags’
include/linux/dcache.h: In function ‘dget_parent’:
include/linux/dcache.h:348: error: ‘struct dentry’ has no member named ‘d_lock’
include/linux/dcache.h:349: error: ‘struct dentry’ has no member named ‘d_parent’
include/linux/dcache.h:350: error: ‘struct dentry’ has no member named ‘d_lock’
include/linux/dcache.h: In function ‘d_mountpoint’:
include/linux/dcache.h:358: error: ‘struct dentry’ has no member named ‘d_mounted’
In file included from include/linux/namei.h:6,
from include/linux/fs.h:276,
from /tmp/vbox.4/r0drv/linux/the-linux-kernel.h:62,
from /tmp/vbox.4/linux/SUPDrv-linux.c:23:
include/linux/mount.h: At top level:
include/linux/mount.h:61: error: expected specifier-qualifier-list before ‘atomic_t’
include/linux/mount.h: In function ‘mntget’:
include/linux/mount.h:69: error: ‘struct vfsmount’ has no member named ‘mnt_count’
include/linux/mount.h: In function ‘mntput’:
include/linux/mount.h:80: error: ‘struct vfsmount’ has no member named ‘mnt_expiry_mark’
include/linux/mount.h: At top level:
include/linux/mount.h:104: error: expected ‘=’, ‘,’, ‘;’, ‘asm’ or ‘__attribute__’ before ‘name_to_dev_t’
In file included from include/linux/fs.h:276,
from /tmp/vbox.4/r0drv/linux/the-linux-kernel.h:62,
from /tmp/vbox.4/linux/SUPDrv-linux.c:23:
include/linux/namei.h:83: warning: ‘struct inode’ declared inside parameter list
In file included from include/linux/fs.h:284,
from /tmp/vbox.4/r0drv/linux/the-linux-kernel.h:62,
from /tmp/vbox.4/linux/SUPDrv-linux.c:23:
include/linux/pid.h:45: error: expected specifier-qualifier-list before ‘atomic_t’
include/linux/pid.h: In function ‘get_pid’:
include/linux/pid.h:65: error: ‘struct pid’ has no member named ‘count’
include/linux/pid.h: At top level:
include/linux/pid.h:101: error: expected ‘=’, ‘,’, ‘;’, ‘asm’ or ‘__attribute__’ before ‘pid_nr’
In file included from /tmp/vbox.4/r0drv/linux/the-linux-kernel.h:62,
from /tmp/vbox.4/linux/SUPDrv-linux.c:23:
include/linux/fs.h:308: warning: ‘struct inode’ declared inside parameter list
include/linux/fs.h:309: error: expected declaration specifiers or ‘...’ before ‘loff_t’
include/linux/fs.h:310: error: expected declaration specifiers or ‘...’ before ‘ssize_t’
include/linux/fs.h:342: error: expected specifier-qualifier-list before ‘umode_t’
In file included from include/linux/fs.h:364,
from /tmp/vbox.4/r0drv/linux/the-linux-kernel.h:62,
from /tmp/vbox.4/linux/SUPDrv-linux.c:23:
include/linux/quota.h:44: error: expected ‘=’, ‘,’, ‘;’, ‘asm’ or ‘__attribute__’ before ‘qid_t’
include/linux/quota.h:45: error: expected ‘=’, ‘,’, ‘;’, ‘asm’ or ‘__attribute__’ before ‘qsize_t’
include/linux/quota.h:104: error: expected specifier-qualifier-list before ‘__u64’
include/linux/quota.h:125: error: expected specifier-qualifier-list before ‘__u64’
In file included from include/linux/quota.h:136,
from include/linux/fs.h:364,
from /tmp/vbox.4/r0drv/linux/the-linux-kernel.h:62,
from /tmp/vbox.4/linux/SUPDrv-linux.c:23:
include/linux/dqblk_xfs.h:51: error: expected specifier-qualifier-list before ‘__s8’
include/linux/dqblk_xfs.h:138: error: expected specifier-qualifier-list before ‘__u64’
include/linux/dqblk_xfs.h:144: error: expected specifier-qualifier-list before ‘__s8’
In file included from include/linux/fs.h:364,
from /tmp/vbox.4/r0drv/linux/the-linux-kernel.h:62,
from /tmp/vbox.4/linux/SUPDrv-linux.c:23:
include/linux/quota.h:153: error: expected specifier-qualifier-list before ‘__u32’
include/linux/quota.h:220: error: expected specifier-qualifier-list before ‘atomic_t’
include/linux/quota.h:248: warning: ‘struct inode’ declared inside parameter list
include/linux/quota.h:249: warning: ‘struct inode’ declared inside parameter list
include/linux/quota.h:250: error: expected declaration specifiers or ‘...’ before ‘qsize_t’
include/linux/quota.h:250: warning: ‘struct inode’ declared inside parameter list
include/linux/quota.h:251: warning: ‘struct inode’ declared inside parameter list
include/linux/quota.h:252: error: expected declaration specifiers or ‘...’ before ‘qsize_t’
include/linux/quota.h:252: warning: ‘struct inode’ declared inside parameter list
include/linux/quota.h:253: warning: ‘struct inode’ declared inside parameter list
include/linux/quota.h:254: warning: ‘struct inode’ declared inside parameter list
include/linux/quota.h:269: error: expected declaration specifiers or ‘...’ before ‘qid_t’
include/linux/quota.h:270: error: expected declaration specifiers or ‘...’ before ‘qid_t’
include/linux/quota.h:273: error: expected declaration specifiers or ‘...’ before ‘qid_t’
include/linux/quota.h:274: error: expected declaration specifiers or ‘...’ before ‘qid_t’
include/linux/quota.h:291: error: field ‘dqptr_sem’ has incomplete type
In file included from /tmp/vbox.4/r0drv/linux/the-linux-kernel.h:62,
from /tmp/vbox.4/linux/SUPDrv-linux.c:23:
include/linux/fs.h:428: error: expected specifier-qualifier-list before ‘ssize_t’
include/linux/fs.h:464: error: expected specifier-qualifier-list before ‘dev_t’
In file included from /tmp/vbox.4/r0drv/linux/the-linux-kernel.h:62,
from /tmp/vbox.4/linux/SUPDrv-linux.c:23:
include/linux/fs.h:525:5: warning: "BITS_PER_LONG" is not defined
include/linux/fs.h:539: error: expected specifier-qualifier-list before ‘atomic_t’
include/linux/fs.h:633: error: expected ‘=’, ‘,’, ‘;’, ‘asm’ or ‘__attribute__’ before ‘i_size_read’
include/linux/fs.h:635:5: warning: "BITS_PER_LONG" is not defined
include/linux/fs.h:644:7: warning: "BITS_PER_LONG" is not defined
include/linux/fs.h:661: error: expected declaration specifiers or ‘...’ before ‘loff_t’
include/linux/fs.h:663:5: warning: "BITS_PER_LONG" is not defined
include/linux/fs.h:667:7: warning: "BITS_PER_LONG" is not defined
include/linux/fs.h: In function ‘i_size_write’:
include/linux/fs.h:672: error: ‘struct inode’ has no member named ‘i_size’
include/linux/fs.h:672: error: ‘i_size’ undeclared (first use in this function)
include/linux/fs.h: In function ‘iminor’:
include/linux/fs.h:678: error: ‘const struct inode’ has no member named ‘i_rdev’
include/linux/fs.h: In function ‘imajor’:
include/linux/fs.h:683: error: ‘const struct inode’ has no member named ‘i_rdev’
include/linux/fs.h: At top level:
include/linux/fs.h:692: error: expected specifier-qualifier-list before ‘uid_t’
include/linux/fs.h:728: error: expected specifier-qualifier-list before ‘atomic_t’
include/linux/fs.h:761:5: warning: "BITS_PER_LONG" is not defined
include/linux/fs.h:763:7: warning: "BITS_PER_LONG" is not defined
include/linux/fs.h:785: warning: ‘struct file_lock’ declared inside parameter list
include/linux/fs.h:786: warning: ‘struct file_lock’ declared inside parameter list
include/linux/fs.h:787: warning: ‘struct file_lock’ declared inside parameter list
include/linux/fs.h:788: warning: ‘struct file_lock’ declared inside parameter list
include/linux/fs.h:792: warning: ‘struct file_lock’ declared inside parameter list
include/linux/fs.h:793: warning: ‘struct file_lock’ declared inside parameter list
include/linux/fs.h:794: warning: ‘struct file_lock’ declared inside parameter list
include/linux/fs.h:795: warning: ‘struct file_lock’ declared inside parameter list
include/linux/fs.h:796: warning: ‘struct file_lock’ declared inside parameter list
include/linux/fs.h:797: warning: ‘struct file_lock’ declared inside parameter list
include/linux/fs.h:798: warning: ‘struct file_lock’ declared inside parameter list
include/linux/fs.h:799: warning: ‘struct file_lock’ declared inside parameter list
In file included from include/linux/nfs.h:130,
from include/linux/nfs_fs_i.h:6,
from include/linux/fs.h:803,
from /tmp/vbox.4/r0drv/linux/the-linux-kernel.h:62,
from /tmp/vbox.4/linux/SUPDrv-linux.c:23:
include/linux/sunrpc/msg_prot.h:18: error: expected ‘=’, ‘,’, ‘;’, ‘asm’ or ‘__attribute__’ before ‘rpc_authflavor_t’
include/linux/sunrpc/msg_prot.h:102: error: expected ‘=’, ‘,’, ‘;’, ‘asm’ or ‘__attribute__’ before ‘rpc_fraghdr’
In file included from include/linux/nfs_fs_i.h:6,
from include/linux/fs.h:803,
from /tmp/vbox.4/r0drv/linux/the-linux-kernel.h:62,
from /tmp/vbox.4/linux/SUPDrv-linux.c:23:
include/linux/nfs.h: In function ‘nfs_compare_fh’:
include/linux/nfs.h:148: error: too many arguments to function ‘memcmp’
include/linux/nfs.h: In function ‘nfs_copy_fh’:
include/linux/nfs.h:154: error: too many arguments to function ‘memcpy’
In file included from include/linux/fs.h:803,
from /tmp/vbox.4/r0drv/linux/the-linux-kernel.h:62,
from /tmp/vbox.4/linux/SUPDrv-linux.c:23:
include/linux/nfs_fs_i.h: At top level:
include/linux/nfs_fs_i.h:14: error: expected specifier-qualifier-list before ‘u32’
In file included from /tmp/vbox.4/r0drv/linux/the-linux-kernel.h:62,
from /tmp/vbox.4/linux/SUPDrv-linux.c:23:
include/linux/fs.h:815: error: expected specifier-qualifier-list before ‘loff_t’
In file included from include/linux/fs.h:836,
from /tmp/vbox.4/r0drv/linux/the-linux-kernel.h:62,
from /tmp/vbox.4/linux/SUPDrv-linux.c:23:
include/linux/fcntl.h:4:23: error: asm/fcntl.h: No such file or directory
include/linux/fcntl.h:44:5: warning: "BITS_PER_LONG" is not defined
In file included from /tmp/vbox.4/r0drv/linux/the-linux-kernel.h:62,
from /tmp/vbox.4/linux/SUPDrv-linux.c:23:
include/linux/fs.h:838: warning: ‘struct flock’ declared inside parameter list
include/linux/fs.h:840: warning: ‘struct flock’ declared inside parameter list
In file included from /tmp/vbox.4/r0drv/linux/the-linux-kernel.h:62,
from /tmp/vbox.4/linux/SUPDrv-linux.c:23:
include/linux/fs.h:842:5: warning: "BITS_PER_LONG" is not defined
include/linux/fs.h:853: error: expected declaration specifiers or ‘...’ before ‘loff_t’
include/linux/fs.h:854: error: expected declaration specifiers or ‘...’ before ‘loff_t’
include/linux/fs.h:873: error: expected declaration specifiers or ‘...’ before ‘loff_t’
include/linux/fs.h:874: error: expected declaration specifiers or ‘...’ before ‘loff_t’
include/linux/fs.h:895: error: expected ‘=’, ‘,’, ‘;’, ‘asm’ or ‘__attribute__’ before ‘f_getown’
include/linux/fs.h:913: error: expected specifier-qualifier-list before ‘dev_t’
include/linux/fs.h:1000: error: expected declaration specifiers or ‘...’ before ‘dev_t’
include/linux/fs.h:1044: error: expected declaration specifiers or ‘...’ before ‘loff_t’
include/linux/fs.h:1044: error: expected declaration specifiers or ‘...’ before ‘u64’
include/linux/fs.h:1053: warning: ‘struct gendisk’ declared inside parameter list
include/linux/fs.h:1054: warning: ‘struct gendisk’ declared inside parameter list
include/linux/fs.h:1093: error: expected specifier-qualifier-list before ‘loff_t’
include/linux/fs.h:1129: error: expected declaration specifiers or ‘...’ before ‘dev_t’
include/linux/fs.h:1140: error: expected specifier-qualifier-list before ‘ssize_t’
include/linux/fs.h:1148: error: expected ‘=’, ‘,’, ‘;’, ‘asm’ or ‘__attribute__’ before ‘rw_copy_check_uvector’
include/linux/fs.h:1153: error: expected ‘=’, ‘,’, ‘;’, ‘asm’ or ‘__attribute__’ before ‘vfs_read’
include/linux/fs.h:1154: error: expected ‘=’, ‘,’, ‘;’, ‘asm’ or ‘__attribute__’ before ‘vfs_write’
include/linux/fs.h:1155: error: expected ‘=’, ‘,’, ‘;’, ‘asm’ or ‘__attribute__’ before ‘vfs_readv’
include/linux/fs.h:1157: error: expected ‘=’, ‘,’, ‘;’, ‘asm’ or ‘__attribute__’ before ‘vfs_writev’
include/linux/fs.h: In function ‘inc_nlink’:
include/linux/fs.h:1227: error: ‘struct inode’ has no member named ‘i_nlink’
include/linux/fs.h: In function ‘drop_nlink’:
include/linux/fs.h:1249: error: ‘struct inode’ has no member named ‘i_nlink’
include/linux/fs.h: In function ‘clear_nlink’:
include/linux/fs.h:1262: error: ‘struct inode’ has no member named ‘i_nlink’
include/linux/fs.h: In function ‘file_accessed’:
include/linux/fs.h:1274: error: ‘struct file’ has no member named ‘f_flags’
include/linux/fs.h:1274: error: ‘O_NOATIME’ undeclared (first use in this function)
include/linux/fs.h: At top level:
include/linux/fs.h:1367: error: expected declaration specifiers or ‘...’ before ‘__u32’
include/linux/fs.h:1370: error: expected declaration specifiers or ‘...’ before ‘__u32’
include/linux/fs.h:1463: error: expected declaration specifiers or ‘...’ before ‘loff_t’
include/linux/fs.h: In function ‘locks_verify_locked’:
include/linux/fs.h:1474: error: ‘struct inode’ has no member named ‘i_sb’
include/linux/fs.h:1474: error: ‘struct inode’ has no member named ‘i_mode’
include/linux/fs.h: At top level:
include/linux/fs.h:1479: error: expected declaration specifiers or ‘...’ before ‘loff_t’
include/linux/fs.h:1483: error: expected declaration specifiers or ‘...’ before ‘loff_t’
include/linux/fs.h: In function ‘locks_verify_truncate’:
include/linux/fs.h:1485: error: ‘struct inode’ has no member named ‘i_flock’
include/linux/fs.h:1485: error: ‘struct inode’ has no member named ‘i_sb’
include/linux/fs.h:1485: error: ‘struct inode’ has no member named ‘i_mode’
include/linux/fs.h:1488: error: ‘size’ undeclared (first use in this function)
include/linux/fs.h:1488: error: ‘struct inode’ has no member named ‘i_size’
include/linux/fs.h:1488: error: ‘struct inode’ has no member named ‘i_size’
include/linux/fs.h:1489: error: ‘struct inode’ has no member named ‘i_size’
include/linux/fs.h:1489: error: ‘struct inode’ has no member named ‘i_size’
include/linux/fs.h:1490: error: ‘struct inode’ has no member named ‘i_size’
include/linux/fs.h:1491: error: too many arguments to function ‘locks_mandatory_area’
include/linux/fs.h: In function ‘break_lease’:
include/linux/fs.h:1497: error: ‘struct inode’ has no member named ‘i_flock’
include/linux/fs.h: At top level:
include/linux/fs.h:1504: error: expected declaration specifiers or ‘...’ before ‘loff_t’
include/linux/fs.h:1565: error: expected ‘)’ before ‘*’ token
include/linux/fs.h:1566: error: expected ‘)’ before ‘unsigned’
include/linux/fs.h:1570: error: expected ‘)’ before ‘unsigned’
include/linux/fs.h:1572: error: expected declaration specifiers or ‘...’ before ‘off_t’
include/linux/fs.h:1589: error: expected declaration specifiers or ‘...’ before ‘umode_t’
include/linux/fs.h:1589: error: expected declaration specifiers or ‘...’ before ‘dev_t’
include/linux/fs.h: In function ‘invalidate_remote_inode’:
include/linux/fs.h:1628: error: ‘struct inode’ has no member named ‘i_mode’
include/linux/fs.h:1628: error: ‘struct inode’ has no member named ‘i_mode’
include/linux/fs.h:1629: error: ‘struct inode’ has no member named ‘i_mode’
include/linux/fs.h:1630: error: ‘struct inode’ has no member named ‘i_mapping’
include/linux/fs.h: At top level:
include/linux/fs.h:1641: error: expected declaration specifiers or ‘...’ before ‘loff_t’
include/linux/fs.h:1641: error: expected declaration specifiers or ‘...’ before ‘loff_t’
include/linux/fs.h:1645: error: expected declaration specifiers or ‘...’ before ‘loff_t’
include/linux/fs.h:1645: error: expected declaration specifiers or ‘...’ before ‘loff_t’
include/linux/fs.h: In function ‘put_write_access’:
include/linux/fs.h:1667: warning: implicit declaration of function ‘atomic_dec’
include/linux/fs.h:1667: error: ‘struct inode’ has no member named ‘i_writecount’
include/linux/fs.h: In function ‘allow_write_access’:
include/linux/fs.h:1672: error: ‘struct dentry’ has no member named ‘d_inode’
include/linux/fs.h: At top level:
include/linux/fs.h:1687: error: expected ‘=’, ‘,’, ‘;’, ‘asm’ or ‘__attribute__’ before ‘find_inode_number’
In file included from /tmp/vbox.4/r0drv/linux/the-linux-kernel.h:62,
from /tmp/vbox.4/linux/SUPDrv-linux.c:23:
include/linux/fs.h:1692: error: expected ‘=’, ‘,’, ‘;’, ‘asm’ or ‘__attribute__’ before ‘default_llseek’
include/linux/fs.h:1694: error: expected ‘=’, ‘,’, ‘;’, ‘asm’ or ‘__attribute__’ before ‘vfs_llseek’
include/linux/fs.h:1699: error: expected ‘=’, ‘,’, ‘;’, ‘asm’ or ‘__attribute__’ before ‘iunique’
include/linux/fs.h: In function ‘iget’:
include/linux/fs.h:1719: error: ‘struct inode’ has no member named ‘i_state’
include/linux/fs.h:1720: error: ‘struct super_block’ has no member named ‘s_op’
include/linux/fs.h: At top level:
include/linux/fs.h:1757: error: expected declaration specifiers or ‘...’ before ‘loff_t’
include/linux/fs.h:1758: error: expected ‘=’, ‘,’, ‘;’, ‘asm’ or ‘__attribute__’ before ‘generic_file_aio_read’
include/linux/fs.h:1759: error: expected ‘=’, ‘,’, ‘;’, ‘asm’ or ‘__attribute__’ before ‘generic_file_aio_write’
include/linux/fs.h:1760: error: expected ‘=’, ‘,’, ‘;’, ‘asm’ or ‘__attribute__’ before ‘generic_file_aio_write_nolock’
include/linux/fs.h:1762: error: expected ‘=’, ‘,’, ‘;’, ‘asm’ or ‘__attribute__’ before ‘generic_file_direct_write’
include/linux/fs.h:1764: error: expected ‘=’, ‘,’, ‘;’, ‘asm’ or ‘__attribute__’ before ‘generic_file_buffered_write’
include/linux/fs.h:1766: error: expected ‘=’, ‘,’, ‘;’, ‘asm’ or ‘__attribute__’ before ‘do_sync_read’
include/linux/fs.h:1767: error: expected ‘=’, ‘,’, ‘;’, ‘asm’ or ‘__attribute__’ before ‘do_sync_write’
include/linux/fs.h:1768: error: expected ‘=’, ‘,’, ‘;’, ‘asm’ or ‘__attribute__’ before ‘generic_file_sendfile’
include/linux/fs.h:1771: error: expected declaration specifiers or ‘...’ before ‘loff_t’
include/linux/fs.h:1776: error: expected ‘=’, ‘,’, ‘;’, ‘asm’ or ‘__attribute__’ before ‘generic_file_splice_read’
include/linux/fs.h:1778: error: expected ‘=’, ‘,’, ‘;’, ‘asm’ or ‘__attribute__’ before ‘generic_file_splice_write’
include/linux/fs.h:1780: error: expected ‘=’, ‘,’, ‘;’, ‘asm’ or ‘__attribute__’ before ‘generic_file_splice_write_nolock’
include/linux/fs.h:1782: error: expected ‘=’, ‘,’, ‘;’, ‘asm’ or ‘__attribute__’ before ‘generic_splice_sendpage’
include/linux/fs.h:1784: error: expected declaration specifiers or ‘...’ before ‘loff_t’
include/linux/fs.h:1789: error: expected ‘=’, ‘,’, ‘;’, ‘asm’ or ‘__attribute__’ before ‘no_llseek’
include/linux/fs.h:1790: error: expected ‘=’, ‘,’, ‘;’, ‘asm’ or ‘__attribute__’ before ‘generic_file_llseek’
include/linux/fs.h:1791: error: expected ‘=’, ‘,’, ‘;’, ‘asm’ or ‘__attribute__’ before ‘remote_llseek’
include/linux/fs.h:1806: error: expected declaration specifiers or ‘...’ before ‘loff_t’
include/linux/fs.h:1812: error: expected declaration specifiers or ‘...’ before ‘loff_t’
include/linux/fs.h: In function ‘do_generic_file_read’:
include/linux/fs.h:1816: error: ‘struct file’ has no member named ‘f_mapping’
include/linux/fs.h:1817: error: ‘struct file’ has no member named ‘f_ra’
include/linux/fs.h:1819: error: ‘ppos’ undeclared (first use in this function)
include/linux/fs.h:1821: warning: passing argument 5 of ‘do_generic_mapping_read’ from incompatible pointer type
include/linux/fs.h:1821: error: too many arguments to function ‘do_generic_mapping_read’
include/linux/fs.h: At top level:
include/linux/fs.h:1880: error: expected declaration specifiers or ‘...’ before ‘loff_t’
include/linux/fs.h:1881: error: expected declaration specifiers or ‘...’ before ‘loff_t’
include/linux/fs.h:1882: error: expected ‘=’, ‘,’, ‘;’, ‘asm’ or ‘__attribute__’ before ‘inode_get_bytes’
include/linux/fs.h:1883: error: expected declaration specifiers or ‘...’ before ‘loff_t’
include/linux/fs.h:1897: warning: parameter names (without types) in function declaration
include/linux/fs.h:1902: error: expected ‘=’, ‘,’, ‘;’, ‘asm’ or ‘__attribute__’ before ‘dcache_dir_lseek’
include/linux/fs.h:1919: error: expected ‘=’, ‘,’, ‘;’, ‘asm’ or ‘__attribute__’ before ‘generic_read_dir’
include/linux/fs.h:1928: error: expected ‘=’, ‘,’, ‘;’, ‘asm’ or ‘__attribute__’ before ‘simple_read_from_buffer’
include/linux/fs.h:1942: error: expected ‘=’, ‘,’, ‘;’, ‘asm’ or ‘__attribute__’ before ‘parent_ino’
include/linux/fs.h:1962: error: expected specifier-qualifier-list before ‘ssize_t’
include/linux/fs.h:1970: error: expected ‘=’, ‘,’, ‘;’, ‘asm’ or ‘__attribute__’ before ‘simple_transaction_read’
include/linux/fs.h: In function ‘simple_transaction_set’:
include/linux/fs.h:1976: error: ‘struct file’ has no member named ‘private_data’
include/linux/fs.h:1978: error: ‘PAGE_SIZE’ undeclared (first use in this function)
include/linux/fs.h:1984: warning: implicit declaration of function ‘smp_mb’
include/linux/fs.h:1985: error: ‘struct simple_transaction_argresp’ has no member named ‘size’
include/linux/fs.h: At top level:
include/linux/fs.h:2025: error: expected declaration specifiers or ‘...’ before ‘u64’
include/linux/fs.h:2025: error: expected declaration specifiers or ‘...’ before ‘u64’
include/linux/fs.h:2028: error: expected ‘=’, ‘,’, ‘;’, ‘asm’ or ‘__attribute__’ before ‘simple_attr_read’
include/linux/fs.h:2030: error: expected ‘=’, ‘,’, ‘;’, ‘asm’ or ‘__attribute__’ before ‘simple_attr_write’
In file included from include/linux/mm.h:5,
from /tmp/vbox.4/r0drv/linux/the-linux-kernel.h:63,
from /tmp/vbox.4/linux/SUPDrv-linux.c:23:
include/linux/capability.h:35: error: expected specifier-qualifier-list before ‘__u32’
include/linux/capability.h:40: error: expected specifier-qualifier-list before ‘__u32’
include/linux/capability.h:60: error: expected ‘=’, ‘,’, ‘;’, ‘asm’ or ‘__attribute__’ before ‘kernel_cap_t’
include/linux/capability.h:297: error: expected ‘=’, ‘,’, ‘;’, ‘asm’ or ‘__attribute__’ before ‘cap_bset’
include/linux/capability.h:325: error: expected ‘=’, ‘,’, ‘;’, ‘asm’ or ‘__attribute__’ before ‘cap_combine’
include/linux/capability.h:332: error: expected ‘=’, ‘,’, ‘;’, ‘asm’ or ‘__attribute__’ before ‘cap_intersect’
include/linux/capability.h:339: error: expected ‘=’, ‘,’, ‘;’, ‘asm’ or ‘__attribute__’ before ‘cap_drop’
include/linux/capability.h:346: error: expected ‘=’, ‘,’, ‘;’, ‘asm’ or ‘__attribute__’ before ‘cap_invert’
In file included from include/linux/mm.h:18,
from /tmp/vbox.4/r0drv/linux/the-linux-kernel.h:63,
from /tmp/vbox.4/linux/SUPDrv-linux.c:23:
include/linux/mm_types.h:21: error: expected specifier-qualifier-list before ‘atomic_t’
In file included from include/linux/mm.h:18,
from /tmp/vbox.4/r0drv/linux/the-linux-kernel.h:63,
from /tmp/vbox.4/linux/SUPDrv-linux.c:23:
include/linux/mm_types.h:49:16: warning: "CONFIG_SPLIT_PTLOCK_CPUS" is not defined
In file included from /tmp/vbox.4/r0drv/linux/the-linux-kernel.h:63,
from /tmp/vbox.4/linux/SUPDrv-linux.c:23:
include/linux/mm.h:40:25: error: asm/pgtable.h: No such file or directory
In file included from /tmp/vbox.4/r0drv/linux/the-linux-kernel.h:63,
from /tmp/vbox.4/linux/SUPDrv-linux.c:23:
include/linux/mm.h:69: error: expected specifier-qualifier-list before ‘pgprot_t’
include/linux/mm.h:193: error: expected ‘=’, ‘,’, ‘;’, ‘asm’ or ‘__attribute__’ before ‘protection_map’
include/linux/mm.h:206: error: expected declaration specifiers or ‘...’ before ‘pgprot_t’
In file included from include/linux/mm.h:230,
from /tmp/vbox.4/r0drv/linux/the-linux-kernel.h:63,
from /tmp/vbox.4/linux/SUPDrv-linux.c:23:
include/linux/page-flags.h:98:6: warning: "BITS_PER_LONG" is not defined
In file included from /tmp/vbox.4/r0drv/linux/the-linux-kernel.h:63,
from /tmp/vbox.4/linux/SUPDrv-linux.c:23:
include/linux/mm.h: In function ‘put_page_testzero’:
include/linux/mm.h:257: warning: implicit declaration of function ‘atomic_dec_and_test’
include/linux/mm.h:257: error: ‘struct page’ has no member named ‘_count’
include/linux/mm.h: In function ‘get_page_unless_zero’:
include/linux/mm.h:267: warning: implicit declaration of function ‘atomic_inc_not_zero’
include/linux/mm.h:267: error: ‘struct page’ has no member named ‘_count’
include/linux/mm.h: In function ‘compound_head’:
include/linux/mm.h:273: error: ‘struct page’ has no member named ‘first_page’
include/linux/mm.h: In function ‘page_count’:
include/linux/mm.h:279: error: ‘struct page’ has no member named ‘_count’
include/linux/mm.h: In function ‘get_page’:
include/linux/mm.h:286: error: ‘struct page’ has no member named ‘_count’
include/linux/mm.h: In function ‘virt_to_head_page’:
include/linux/mm.h:291: warning: implicit declaration of function ‘virt_to_page’
include/linux/mm.h:291: warning: initialization makes pointer from integer without a cast
include/linux/mm.h: In function ‘init_page_count’:
include/linux/mm.h:301: warning: implicit declaration of function ‘atomic_set’
include/linux/mm.h:301: error: ‘struct page’ has no member named ‘_count’
include/linux/mm.h: In function ‘set_compound_page_dtor’:
include/linux/mm.h:319: error: ‘struct page’ has no member named ‘lru’
include/linux/mm.h: In function ‘get_compound_page_dtor’:
include/linux/mm.h:324: error: ‘struct page’ has no member named ‘lru’
include/linux/mm.h: In function ‘compound_order’:
include/linux/mm.h:331: error: ‘struct page’ has no member named ‘lru’
include/linux/mm.h: In function ‘set_compound_order’:
include/linux/mm.h:336: error: ‘struct page’ has no member named ‘lru’
In file included from /tmp/vbox.4/r0drv/linux/the-linux-kernel.h:63,
from /tmp/vbox.4/linux/SUPDrv-linux.c:23:
include/linux/mm.h:427:47: warning: "FLAGS_RESERVED" is not defined
include/linux/mm.h:472:46: warning: "FLAGS_RESERVED" is not defined
In file included from include/linux/mm.h:556,
from /tmp/vbox.4/r0drv/linux/the-linux-kernel.h:63,
from /tmp/vbox.4/linux/SUPDrv-linux.c:23:
include/linux/vmstat.h: At top level:
include/linux/vmstat.h:122: error: expected ‘=’, ‘,’, ‘;’, ‘asm’ or ‘__attribute__’ before ‘vm_stat’
include/linux/vmstat.h: In function ‘zone_page_state_add’:
include/linux/vmstat.h:127: warning: implicit declaration of function ‘atomic_long_add’
include/linux/vmstat.h:127: error: ‘struct zone’ has no member named ‘vm_stat’
include/linux/vmstat.h:128: error: ‘vm_stat’ undeclared (first use in this function)
include/linux/vmstat.h: In function ‘global_page_state’:
include/linux/vmstat.h:133: warning: implicit declaration of function ‘atomic_long_read’
include/linux/vmstat.h:133: error: ‘vm_stat’ undeclared (first use in this function)
include/linux/vmstat.h: In function ‘zone_page_state’:
include/linux/vmstat.h:144: error: ‘struct zone’ has no member named ‘vm_stat’
include/linux/vmstat.h: In function ‘zap_zone_vm_stats’:
include/linux/vmstat.h:195: error: ‘struct zone’ has no member named ‘vm_stat’
include/linux/vmstat.h:195: error: ‘struct zone’ has no member named ‘vm_stat’
include/linux/vmstat.h:195: error: too many arguments to function ‘memset’
include/linux/vmstat.h: In function ‘__inc_zone_state’:
include/linux/vmstat.h:229: warning: implicit declaration of function ‘atomic_long_inc’
include/linux/vmstat.h:229: error: ‘struct zone’ has no member named ‘vm_stat’
include/linux/vmstat.h:230: error: ‘vm_stat’ undeclared (first use in this function)
include/linux/vmstat.h: In function ‘__dec_zone_state’:
include/linux/vmstat.h:241: warning: implicit declaration of function ‘atomic_long_dec’
include/linux/vmstat.h:241: error: ‘struct zone’ has no member named ‘vm_stat’
include/linux/vmstat.h:242: error: ‘vm_stat’ undeclared (first use in this function)
include/linux/vmstat.h: In function ‘__dec_zone_page_state’:
include/linux/vmstat.h:248: error: ‘struct zone’ has no member named ‘vm_stat’
include/linux/vmstat.h:249: error: ‘vm_stat’ undeclared (first use in this function)
In file included from /tmp/vbox.4/r0drv/linux/the-linux-kernel.h:63,
from /tmp/vbox.4/linux/SUPDrv-linux.c:23:
include/linux/mm.h: In function ‘lowmem_page_address’:
include/linux/mm.h:560: warning: implicit declaration of function ‘__va’
include/linux/mm.h:560: warning: implicit declaration of function ‘page_to_pfn’
include/linux/mm.h:560: error: ‘PAGE_SHIFT’ undeclared (first use in this function)
include/linux/mm.h:560: warning: return makes pointer from integer without a cast
include/linux/mm.h: In function ‘page_mapping’:
include/linux/mm.h:602: error: ‘struct page’ has no member named ‘mapping’
include/linux/mm.h: In function ‘PageAnon’:
include/linux/mm.h:617: error: ‘struct page’ has no member named ‘mapping’
include/linux/mm.h: In function ‘page_index’:
include/linux/mm.h:627: error: ‘struct page’ has no member named ‘private’
include/linux/mm.h:628: error: ‘struct page’ has no member named ‘index’
include/linux/mm.h: In function ‘reset_page_mapcount’:
include/linux/mm.h:638: error: ‘struct page’ has no member named ‘_mapcount’
include/linux/mm.h: In function ‘page_mapcount’:
include/linux/mm.h:643: error: ‘struct page’ has no member named ‘_mapcount’
include/linux/mm.h: In function ‘page_mapped’:
include/linux/mm.h:651: error: ‘struct page’ has no member named ‘_mapcount’
include/linux/mm.h: At top level:
include/linux/mm.h:712: error: expected declaration specifiers or ‘...’ before ‘loff_t’
include/linux/mm.h:740: error: expected declaration specifiers or ‘...’ before ‘pte_t’
include/linux/mm.h:754: error: expected declaration specifiers or ‘...’ before ‘pgprot_t’
include/linux/mm.h:756: error: expected declaration specifiers or ‘...’ before ‘loff_t’
include/linux/mm.h:756: error: expected declaration specifiers or ‘...’ before ‘loff_t’
include/linux/mm.h:759: error: expected declaration specifiers or ‘...’ before ‘loff_t’
include/linux/mm.h:759: error: expected declaration specifiers or ‘...’ before ‘loff_t’
include/linux/mm.h: In function ‘unmap_shared_mapping_range’:
include/linux/mm.h:761: error: ‘holebegin’ undeclared (first use in this function)
include/linux/mm.h:761: error: ‘holelen’ undeclared (first use in this function)
include/linux/mm.h:761: error: too many arguments to function ‘unmap_mapping_range’
include/linux/mm.h: At top level:
include/linux/mm.h:764: error: expected declaration specifiers or ‘...’ before ‘loff_t’
include/linux/mm.h:765: error: expected declaration specifiers or ‘...’ before ‘loff_t’
include/linux/mm.h:765: error: expected declaration specifiers or ‘...’ before ‘loff_t’
include/linux/mm.h:766: error: expected declaration specifiers or ‘...’ before ‘pgprot_t’
include/linux/mm.h:767: error: expected declaration specifiers or ‘...’ before ‘pgprot_t’
include/linux/mm.h: In function ‘handle_mm_fault’:
include/linux/mm.h:786: warning: implicit declaration of function ‘BUG’
include/linux/mm.h: At top level:
include/linux/mm.h:797: error: expected declaration specifiers or ‘...’ before ‘pte_t’
include/linux/mm.h: In function ‘vma_wants_writenotify’:
include/linux/mm.h:845: error: ‘struct vm_area_struct’ has no member named ‘vm_flags’
include/linux/mm.h:852: error: ‘struct vm_area_struct’ has no member named ‘vm_ops’
include/linux/mm.h:852: error: ‘struct vm_area_struct’ has no member named ‘vm_ops’
include/linux/mm.h:856: warning: implicit declaration of function ‘pgprot_val’
include/linux/mm.h:856: error: ‘struct vm_area_struct’ has no member named ‘vm_page_prot’
include/linux/mm.h:857: error: ‘protection_map’ undeclared (first use in this function)
include/linux/mm.h:866: error: ‘struct vm_area_struct’ has no member named ‘vm_file’
include/linux/mm.h:866: error: ‘struct vm_area_struct’ has no member named ‘vm_file’
include/linux/mm.h:867: error: ‘struct vm_area_struct’ has no member named ‘vm_file’
include/linux/mm.h: At top level:
include/linux/mm.h:870: error: expected ‘=’, ‘,’, ‘;’, ‘asm’ or ‘__attribute__’ before ‘*’ token
include/linux/mm.h:879: error: expected declaration specifiers or ‘...’ before ‘pgd_t’
include/linux/mm.h:889: error: expected declaration specifiers or ‘...’ before ‘pud_t’
include/linux/mm.h:892: error: expected declaration specifiers or ‘...’ before ‘pmd_t’
include/linux/mm.h:893: error: expected ‘)’ before ‘*’ token
include/linux/mm.h:913:16: warning: "CONFIG_SPLIT_PTLOCK_CPUS" is not defined
include/linux/mm.h: In function ‘vma_nonlinear_insert’:
include/linux/mm.h:1043: error: ‘struct vm_area_struct’ has no member named ‘shared’
include/linux/mm.h:1044: error: ‘struct vm_area_struct’ has no member named ‘shared’
include/linux/mm.h: In function ‘do_mmap’:
include/linux/mm.h:1080: error: ‘EINVAL’ undeclared (first use in this function)
include/linux/mm.h:1081: warning: implicit declaration of function ‘PAGE_ALIGN’
include/linux/mm.h:1083: error: ‘PAGE_MASK’ undeclared (first use in this function)
include/linux/mm.h:1084: error: ‘PAGE_SHIFT’ undeclared (first use in this function)
include/linux/mm.h: At top level:
include/linux/mm.h:1095: error: expected declaration specifiers or ‘...’ before ‘loff_t’
include/linux/mm.h:1097: error: expected declaration specifiers or ‘...’ before ‘loff_t’
include/linux/mm.h:1097: error: expected declaration specifiers or ‘...’ before ‘loff_t’
include/linux/mm.h:1102: error: expected declaration specifiers or ‘...’ before ‘pgprot_t’
include/linux/mm.h: In function ‘vma_pages’:
include/linux/mm.h:1150: error: ‘PAGE_SHIFT’ undeclared (first use in this function)
include/linux/mm.h: At top level:
include/linux/mm.h:1153: error: expected ‘=’, ‘,’, ‘;’, ‘asm’ or ‘__attribute__’ before ‘vm_get_page_prot’
include/linux/mm.h:1158: error: expected declaration specifiers or ‘...’ before ‘pgprot_t’
include/linux/mm.h:1170: error: expected ‘)’ before ‘*’ token
include/linux/mm.h:1173: error: expected declaration specifiers or ‘...’ before ‘pte_fn_t’
include/linux/mm.h:1199: error: expected declaration specifiers or ‘...’ before ‘loff_t’
In file included from include/linux/highmem.h:6,
from include/linux/pagemap.h:10,
from /tmp/vbox.4/r0drv/linux/the-linux-kernel.h:64,
from /tmp/vbox.4/linux/SUPDrv-linux.c:23:
include/linux/uaccess.h:5:25: error: asm/uaccess.h: No such file or directory
In file included from include/linux/highmem.h:6,
from include/linux/pagemap.h:10,
from /tmp/vbox.4/r0drv/linux/the-linux-kernel.h:64,
from /tmp/vbox.4/linux/SUPDrv-linux.c:23:
include/linux/uaccess.h: In function ‘pagefault_disable’:
include/linux/uaccess.h:18: warning: implicit declaration of function ‘current_thread_info’
include/linux/uaccess.h:18: error: invalid type argument of ‘->’
include/linux/uaccess.h: In function ‘pagefault_enable’:
include/linux/uaccess.h:33: error: invalid type argument of ‘->’
include/linux/uaccess.h: In function ‘__copy_from_user_inatomic_nocache’:
include/linux/uaccess.h:46: warning: implicit declaration of function ‘__copy_from_user_inatomic’
include/linux/uaccess.h: In function ‘__copy_from_user_nocache’:
include/linux/uaccess.h:52: warning: implicit declaration of function ‘__copy_from_user’
In file included from include/linux/pagemap.h:10,
from /tmp/vbox.4/r0drv/linux/the-linux-kernel.h:64,
from /tmp/vbox.4/linux/SUPDrv-linux.c:23:
include/linux/highmem.h:8:28: error: asm/cacheflush.h: No such file or directory
include/linux/highmem.h:47:28: error: asm/kmap_types.h: No such file or directory
In file included from include/linux/pagemap.h:10,
from /tmp/vbox.4/r0drv/linux/the-linux-kernel.h:64,
from /tmp/vbox.4/linux/SUPDrv-linux.c:23:
include/linux/highmem.h: At top level:
include/linux/highmem.h:49: warning: ‘enum km_type’ declared inside parameter list
include/linux/highmem.h:49: error: parameter 2 (‘idx’) has incomplete type
include/linux/highmem.h: In function ‘clear_user_highpage’:
include/linux/highmem.h:68: error: ‘KM_USER0’ undeclared (first use in this function)
include/linux/highmem.h:68: error: type of formal parameter 2 is incomplete
include/linux/highmem.h:69: warning: implicit declaration of function ‘clear_user_page’
include/linux/highmem.h: In function ‘clear_highpage’:
include/linux/highmem.h:90: error: ‘KM_USER0’ undeclared (first use in this function)
include/linux/highmem.h:90: error: type of formal parameter 2 is incomplete
include/linux/highmem.h:91: warning: implicit declaration of function ‘clear_page’
include/linux/highmem.h: In function ‘memclear_highpage_flush’:
include/linux/highmem.h:116: error: ‘PAGE_SIZE’ undeclared (first use in this function)
include/linux/highmem.h:116: error: ‘KM_USER0’ undeclared (first use in this function)
include/linux/highmem.h:116: error: type of formal parameter 2 is incomplete
include/linux/highmem.h:116: error: too many arguments to function ‘memset’
include/linux/highmem.h:116: warning: implicit declaration of function ‘flush_dcache_page’
include/linux/highmem.h: In function ‘copy_user_highpage’:
include/linux/highmem.h:126: error: ‘KM_USER0’ undeclared (first use in this function)
include/linux/highmem.h:126: error: type of formal parameter 2 is incomplete
include/linux/highmem.h:127: error: ‘KM_USER1’ undeclared (first use in this function)
include/linux/highmem.h:127: error: type of formal parameter 2 is incomplete
include/linux/highmem.h:128: warning: implicit declaration of function ‘copy_user_page’
include/linux/highmem.h: In function ‘copy_highpage’:
include/linux/highmem.h:141: error: ‘KM_USER0’ undeclared (first use in this function)
include/linux/highmem.h:141: error: type of formal parameter 2 is incomplete
include/linux/highmem.h:142: error: ‘KM_USER1’ undeclared (first use in this function)
include/linux/highmem.h:142: error: type of formal parameter 2 is incomplete
include/linux/highmem.h:143: warning: implicit declaration of function ‘copy_page’
In file included from /tmp/vbox.4/r0drv/linux/the-linux-kernel.h:64,
from /tmp/vbox.4/linux/SUPDrv-linux.c:23:
include/linux/pagemap.h: In function ‘mapping_set_error’:
include/linux/pagemap.h:26: error: ‘ENOSPC’ undeclared (first use in this function)
include/linux/pagemap.h: At top level:
include/linux/pagemap.h:143: error: expected ‘=’, ‘,’, ‘;’, ‘asm’ or ‘__attribute__’ before ‘page_offset’
include/linux/pagemap.h: In function ‘linear_page_index’:
include/linux/pagemap.h:151: error: ‘PAGE_SHIFT’ undeclared (first use in this function)
include/linux/pagemap.h:152: error: ‘struct vm_area_struct’ has no member named ‘vm_pgoff’
include/linux/pagemap.h: In function ‘fault_in_pages_writeable’:
include/linux/pagemap.h:225: warning: implicit declaration of function ‘__put_user’
include/linux/pagemap.h:233: error: ‘PAGE_MASK’ undeclared (first use in this function)
include/linux/pagemap.h: In function ‘fault_in_pages_readable’:
include/linux/pagemap.h:245: warning: implicit declaration of function ‘__get_user’
include/linux/pagemap.h:249: error: ‘PAGE_MASK’ undeclared (first use in this function)
In file included from /tmp/vbox.4/linux/SUPDrv-linux.c:23:
/tmp/vbox.4/r0drv/linux/the-linux-kernel.h:66:5: warning: "LINUX_VERSION_CODE" is not defined
/tmp/vbox.4/r0drv/linux/the-linux-kernel.h:66:27: warning: "KERNEL_VERSION" is not defined
/tmp/vbox.4/r0drv/linux/the-linux-kernel.h:66:41: error: missing binary operator before token "("
In file included from include/linux/pci.h:44,
from /tmp/vbox.4/r0drv/linux/the-linux-kernel.h:72,
from /tmp/vbox.4/linux/SUPDrv-linux.c:23:
include/linux/mod_devicetable.h: At top level:
include/linux/mod_devicetable.h:18: error: expected specifier-qualifier-list before ‘__u32’
include/linux/mod_devicetable.h:31: error: expected specifier-qualifier-list before ‘__u32’
include/linux/mod_devicetable.h:100: error: expected specifier-qualifier-list before ‘__u16’
include/linux/mod_devicetable.h:136: error: expected specifier-qualifier-list before ‘__u16’
include/linux/mod_devicetable.h:153: error: expected specifier-qualifier-list before ‘__u16’
include/linux/mod_devicetable.h:167: error: expected specifier-qualifier-list before ‘__u8’
include/linux/mod_devicetable.h:172: error: expected specifier-qualifier-list before ‘__u8’
include/linux/mod_devicetable.h:183: error: expected specifier-qualifier-list before ‘__u8’
include/linux/mod_devicetable.h:213: error: expected specifier-qualifier-list before ‘__u16’
include/linux/mod_devicetable.h:260: error: expected specifier-qualifier-list before ‘__u16’
include/linux/mod_devicetable.h:294: error: expected specifier-qualifier-list before ‘__u16’
include/linux/mod_devicetable.h:325: error: expected specifier-qualifier-list before ‘__u8’
include/linux/mod_devicetable.h:338: error: expected specifier-qualifier-list before ‘__u16’
In file included from include/linux/pci.h:47,
from /tmp/vbox.4/r0drv/linux/the-linux-kernel.h:72,
from /tmp/vbox.4/linux/SUPDrv-linux.c:23:
include/linux/ioport.h:18: error: expected specifier-qualifier-list before ‘resource_size_t’
include/linux/ioport.h:105: error: expected declaration specifiers or ‘...’ before ‘resource_size_t’
include/linux/ioport.h:105: error: expected declaration specifiers or ‘...’ before ‘resource_size_t’
include/linux/ioport.h:106: error: expected declaration specifiers or ‘...’ before ‘resource_size_t’
include/linux/ioport.h:106: error: expected declaration specifiers or ‘...’ before ‘resource_size_t’
include/linux/ioport.h:108: error: expected declaration specifiers or ‘...’ before ‘resource_size_t’
include/linux/ioport.h:108: error: expected declaration specifiers or ‘...’ before ‘resource_size_t’
include/linux/ioport.h:110: error: expected declaration specifiers or ‘...’ before ‘resource_size_t’
include/linux/ioport.h:111: error: expected declaration specifiers or ‘...’ before ‘resource_size_t’
include/linux/ioport.h:122: error: expected declaration specifiers or ‘...’ before ‘resource_size_t’
include/linux/ioport.h:123: error: expected declaration specifiers or ‘...’ before ‘resource_size_t’
include/linux/ioport.h:130: error: expected declaration specifiers or ‘...’ before ‘resource_size_t’
include/linux/ioport.h:130: error: expected declaration specifiers or ‘...’ before ‘resource_size_t’
include/linux/ioport.h:131: error: expected declaration specifiers or ‘...’ before ‘resource_size_t’
include/linux/ioport.h:132: error: expected declaration specifiers or ‘...’ before ‘resource_size_t’
include/linux/ioport.h:134: error: expected ‘)’ before ‘s’
include/linux/ioport.h:148: error: expected declaration specifiers or ‘...’ before ‘resource_size_t’
include/linux/ioport.h:149: error: expected declaration specifiers or ‘...’ before ‘resource_size_t’
include/linux/ioport.h:157: error: expected declaration specifiers or ‘...’ before ‘resource_size_t’
include/linux/ioport.h:157: error: expected declaration specifiers or ‘...’ before ‘resource_size_t’
In file included from include/linux/pci.h:52,
from /tmp/vbox.4/r0drv/linux/the-linux-kernel.h:72,
from /tmp/vbox.4/linux/SUPDrv-linux.c:23:
include/linux/device.h:25:24: error: asm/device.h: No such file or directory
In file included from include/linux/pci.h:52,
from /tmp/vbox.4/r0drv/linux/the-linux-kernel.h:72,
from /tmp/vbox.4/linux/SUPDrv-linux.c:23:
include/linux/device.h:41: error: expected specifier-qualifier-list before ‘ssize_t’
include/linux/device.h:156: error: expected specifier-qualifier-list before ‘ssize_t’
include/linux/device.h:186: error: field ‘sem’ has incomplete type
include/linux/device.h:211: error: expected specifier-qualifier-list before ‘ssize_t’
include/linux/device.h:224: error: expected specifier-qualifier-list before ‘ssize_t’
include/linux/device.h:265: error: expected specifier-qualifier-list before ‘dev_t’
include/linux/device.h: In function ‘class_get_devdata’:
include/linux/device.h:282: error: ‘struct class_device’ has no member named ‘class_data’
include/linux/device.h: In function ‘class_set_devdata’:
include/linux/device.h:288: error: ‘struct class_device’ has no member named ‘class_data’
include/linux/device.h: At top level:
include/linux/device.h:325: error: expected declaration specifiers or ‘...’ before ‘dev_t’
include/linux/device.h:328: error: format string argument not a string type
include/linux/device.h:329: error: expected declaration specifiers or ‘...’ before ‘dev_t’
include/linux/device.h:353: error: expected specifier-qualifier-list before ‘ssize_t’
include/linux/device.h:425: error: field ‘sem’ has incomplete type
include/linux/device.h:440: error: expected specifier-qualifier-list before ‘u64’
include/linux/device.h:533: error: expected declaration specifiers or ‘...’ before ‘dev_t’
include/linux/device.h:534: error: format string argument not a string type
include/linux/device.h:535: error: expected declaration specifiers or ‘...’ before ‘dev_t’
In file included from /tmp/vbox.4/r0drv/linux/the-linux-kernel.h:72,
from /tmp/vbox.4/linux/SUPDrv-linux.c:23:
include/linux/pci.h:120: error: expected specifier-qualifier-list before ‘u32’
include/linux/pci.h:141: error: expected specifier-qualifier-list before ‘u8’
include/linux/pci.h: In function ‘pci_channel_offline’:
include/linux/pci.h:205: error: ‘struct pci_dev’ has no member named ‘error_state’
include/linux/pci.h: In function ‘pci_find_saved_cap’:
include/linux/pci.h:214: error: ‘struct pci_dev’ has no member named ‘saved_cap_space’
include/linux/pci.h: In function ‘pci_add_saved_cap’:
include/linux/pci.h:224: error: ‘struct pci_dev’ has no member named ‘saved_cap_space’
include/linux/pci.h: At top level:
include/linux/pci.h:290: error: expected declaration specifiers or ‘...’ before ‘u32’
include/linux/pci.h:291: error: expected declaration specifiers or ‘...’ before ‘u32’
include/linux/pci.h:296: error: expected declaration specifiers or ‘...’ before ‘u32’
include/linux/pci.h:298: error: expected declaration specifiers or ‘...’ before ‘u32’
include/linux/pci.h:695: error: expected declaration specifiers or ‘...’ before ‘u8’
include/linux/pci.h:695: error: expected declaration specifiers or ‘...’ before ‘u16’
include/linux/pci.h:695: error: expected declaration specifiers or ‘...’ before ‘u32’
include/linux/pci.h:696: error: expected declaration specifiers or ‘...’ before ‘u8’
include/linux/pci.h:696: error: expected declaration specifiers or ‘...’ before ‘u16’
include/linux/pci.h:696: error: expected declaration specifiers or ‘...’ before ‘u32’
include/linux/pci.h: In function ‘pci_enable_device’:
include/linux/pci.h:724: error: ‘EIO’ undeclared (first use in this function)
include/linux/pci.h: At top level:
include/linux/pci.h:726: error: expected declaration specifiers or ‘...’ before ‘u64’
include/linux/pci.h: In function ‘pci_set_dma_mask’:
include/linux/pci.h:726: error: ‘EIO’ undeclared (first use in this function)
include/linux/pci.h: In function ‘pci_assign_resource’:
include/linux/pci.h:727: error: ‘EBUSY’ undeclared (first use in this function)
include/linux/pci.h: At top level:
include/linux/pci.h:732: error: expected declaration specifiers or ‘...’ before ‘u8’
include/linux/pci.h: In function ‘pci_request_regions’:
include/linux/pci.h:743: error: ‘EIO’ undeclared (first use in this function)
In file included from /tmp/vbox.4/r0drv/linux/the-linux-kernel.h:72,
from /tmp/vbox.4/linux/SUPDrv-linux.c:23:
include/linux/pci.h:766:21: error: asm/pci.h: No such file or directory
include/linux/pci.h: In function ‘pci_get_drvdata’:
include/linux/pci.h:787: error: ‘struct pci_dev’ has no member named ‘dev’
include/linux/pci.h: In function ‘pci_set_drvdata’:
include/linux/pci.h:792: error: ‘struct pci_dev’ has no member named ‘dev’
include/linux/pci.h: In function ‘pci_name’:
include/linux/pci.h:800: error: ‘struct pci_dev’ has no member named ‘dev’
include/linux/pci.h: At top level:
include/linux/pci.h:809: error: expected declaration specifiers or ‘...’ before ‘resource_size_t’
include/linux/pci.h:810: error: expected declaration specifiers or ‘...’ before ‘resource_size_t’
include/linux/pci.h: In function ‘pci_resource_to_user’:
include/linux/pci.h:812: error: ‘start’ undeclared (first use in this function)
include/linux/pci.h:812: error: ‘const struct resource’ has no member named ‘start’
include/linux/pci.h:813: error: ‘end’ undeclared (first use in this function)
include/linux/pci.h:813: error: ‘const struct resource’ has no member named ‘end’
include/linux/pci.h: At top level:
include/linux/pci.h:826: error: expected specifier-qualifier-list before ‘u16’
include/linux/pci.h:864: error: expected declaration specifiers or ‘...’ before ‘u16’
include/linux/pci.h:865: error: expected declaration specifiers or ‘...’ before ‘u16’
In file included from /tmp/vbox.4/r0drv/linux/the-linux-kernel.h:73,
from /tmp/vbox.4/linux/SUPDrv-linux.c:23:
include/linux/delay.h:12:23: error: asm/delay.h: No such file or directory
In file included from include/linux/interrupt.h:11,
from /tmp/vbox.4/r0drv/linux/the-linux-kernel.h:74,
from /tmp/vbox.4/linux/SUPDrv-linux.c:23:
include/linux/hardirq.h:7:25: error: asm/hardirq.h: No such file or directory
include/linux/hardirq.h:40:27: warning: "NR_IRQS" is not defined
include/linux/hardirq.h:59:5: warning: "PREEMPT_ACTIVE" is not defined
include/linux/hardirq.h:60:2: error: #error PREEMPT_ACTIVE is too low!
In file included from include/linux/interrupt.h:12,
from /tmp/vbox.4/r0drv/linux/the-linux-kernel.h:74,
from /tmp/vbox.4/linux/SUPDrv-linux.c:23:
include/linux/sched.h:68:24: error: asm/ptrace.h: No such file or directory
include/linux/sched.h:69:21: error: asm/mmu.h: No such file or directory
include/linux/sched.h:70:25: error: asm/cputime.h: No such file or directory
In file included from include/linux/sem.h:4,
from include/linux/sched.h:73,
from include/linux/interrupt.h:12,
from /tmp/vbox.4/r0drv/linux/the-linux-kernel.h:74,
from /tmp/vbox.4/linux/SUPDrv-linux.c:23:
include/linux/ipc.h:12: error: expected specifier-qualifier-list before ‘__kernel_uid_t’
In file included from include/linux/sem.h:4,
from include/linux/sched.h:73,
from include/linux/interrupt.h:12,
from /tmp/vbox.4/r0drv/linux/the-linux-kernel.h:74,
from /tmp/vbox.4/linux/SUPDrv-linux.c:23:
include/linux/ipc.h:21:24: error: asm/ipcbuf.h: No such file or directory
include/linux/ipc.h:64: error: expected specifier-qualifier-list before ‘uid_t’
In file included from include/linux/sched.h:73,
from include/linux/interrupt.h:12,
from /tmp/vbox.4/r0drv/linux/the-linux-kernel.h:74,
from /tmp/vbox.4/linux/SUPDrv-linux.c:23:
include/linux/sem.h:25: error: expected specifier-qualifier-list before ‘__kernel_time_t’
In file included from include/linux/sched.h:73,
from include/linux/interrupt.h:12,
from /tmp/vbox.4/r0drv/linux/the-linux-kernel.h:74,
from /tmp/vbox.4/linux/SUPDrv-linux.c:23:
include/linux/sem.h:35:24: error: asm/sembuf.h: No such file or directory
include/linux/sem.h:94: error: expected specifier-qualifier-list before ‘time_t’
include/linux/sem.h:132: error: expected specifier-qualifier-list before ‘atomic_t’
In file included from include/linux/sched.h:74,
from include/linux/interrupt.h:12,
from /tmp/vbox.4/r0drv/linux/the-linux-kernel.h:74,
from /tmp/vbox.4/linux/SUPDrv-linux.c:23:
include/linux/signal.h:4:24: error: asm/signal.h: No such file or directory
include/linux/signal.h:5:25: error: asm/siginfo.h: No such file or directory
In file included from include/linux/sched.h:74,
from include/linux/interrupt.h:12,
from /tmp/vbox.4/r0drv/linux/the-linux-kernel.h:74,
from /tmp/vbox.4/linux/SUPDrv-linux.c:23:
include/linux/signal.h:18: error: expected specifier-qualifier-list before ‘siginfo_t’
include/linux/signal.h:27: error: expected specifier-qualifier-list before ‘sigset_t’
include/linux/signal.h:39: error: expected ‘)’ before ‘*’ token
include/linux/signal.h:48: error: expected ‘)’ before ‘*’ token
include/linux/signal.h:57: error: expected ‘)’ before ‘*’ token
include/linux/signal.h: In function ‘sigfindinword’:
include/linux/signal.h:68: warning: implicit declaration of function ‘ffz’
include/linux/signal.h: At top level:
include/linux/signal.h:73: error: expected ‘)’ before ‘*’ token
include/linux/signal.h:120: error: expected ‘)’ before ‘*’ token
include/linux/signal.h:123: error: expected ‘)’ before ‘*’ token
include/linux/signal.h:126: error: expected ‘)’ before ‘*’ token
include/linux/signal.h:150: error: expected ‘)’ before ‘*’ token
include/linux/signal.h:155: error: expected ‘)’ before ‘*’ token
include/linux/signal.h:167: error: expected ‘)’ before ‘*’ token
include/linux/signal.h:181: error: expected ‘)’ before ‘*’ token
include/linux/signal.h:186: error: expected ‘)’ before ‘*’ token
include/linux/signal.h:191: error: expected ‘)’ before ‘*’ token
include/linux/signal.h:196: error: expected ‘)’ before ‘*’ token
include/linux/signal.h:208: error: expected ‘)’ before ‘*’ token
include/linux/signal.h: In function ‘init_sigpending’:
include/linux/signal.h:224: warning: implicit declaration of function ‘sigemptyset’
include/linux/signal.h:224: error: ‘struct sigpending’ has no member named ‘signal’
include/linux/signal.h: In function ‘valid_signal’:
include/linux/signal.h:233: error: ‘_NSIG’ undeclared (first use in this function)
include/linux/signal.h: At top level:
include/linux/signal.h:236: error: expected declaration specifiers or ‘...’ before ‘sigset_t’
include/linux/signal.h:237: warning: ‘struct siginfo’ declared inside parameter list
include/linux/signal.h:238: warning: ‘struct siginfo’ declared inside parameter list
include/linux/signal.h:240: error: expected declaration specifiers or ‘...’ before ‘sigset_t’
include/linux/signal.h:240: error: expected declaration specifiers or ‘...’ before ‘sigset_t’
include/linux/signal.h:243: error: expected ‘)’ before ‘*’ token
include/linux/signal.h:327:5: warning: "SIGRTMIN" is not defined
include/linux/signal.h:327:16: warning: "BITS_PER_LONG" is not defined
In file included from include/linux/sched.h:76,
from include/linux/interrupt.h:12,
from /tmp/vbox.4/r0drv/linux/the-linux-kernel.h:74,
from /tmp/vbox.4/linux/SUPDrv-linux.c:23:
include/linux/fs_struct.h:8: error: expected specifier-qualifier-list before ‘atomic_t’
In file included from include/linux/sched.h:82,
from include/linux/interrupt.h:12,
from /tmp/vbox.4/r0drv/linux/the-linux-kernel.h:74,
from /tmp/vbox.4/linux/SUPDrv-linux.c:23:
include/linux/seccomp.h:32: warning: ‘struct thread_info’ declared inside parameter list
In file included from include/linux/sched.h:84,
from include/linux/interrupt.h:12,
from /tmp/vbox.4/r0drv/linux/the-linux-kernel.h:74,
from /tmp/vbox.4/linux/SUPDrv-linux.c:23:
include/linux/futex.h:111: error: expected ‘)’ before ‘*’ token
include/linux/futex.h:115: error: expected ‘)’ before ‘*’ token
include/linux/futex.h:152: error: expected ‘)’ before ‘*’ token
In file included from include/linux/sched.h:89,
from include/linux/interrupt.h:12,
from /tmp/vbox.4/r0drv/linux/the-linux-kernel.h:74,
from /tmp/vbox.4/linux/SUPDrv-linux.c:23:
include/linux/resource.h:70:26: error: asm/resource.h: No such file or directory
In file included from include/linux/sched.h:91,
from include/linux/interrupt.h:12,
from /tmp/vbox.4/r0drv/linux/the-linux-kernel.h:74,
from /tmp/vbox.4/linux/SUPDrv-linux.c:23:
include/linux/hrtimer.h:158: error: expected specifier-qualifier-list before ‘clockid_t’
include/linux/hrtimer.h: In function ‘hrtimer_cb_get_time’:
include/linux/hrtimer.h:248: error: ‘struct hrtimer_clock_base’ has no member named ‘softirq_time’
include/linux/hrtimer.h: At top level:
include/linux/hrtimer.h:259: error: expected declaration specifiers or ‘...’ before ‘clockid_t’
include/linux/hrtimer.h:275: warning: type defaults to ‘int’ in declaration of ‘clockid_t’
include/linux/hrtimer.h:275: error: expected ‘;’, ‘,’ or ‘)’ before ‘which_clock’
include/linux/hrtimer.h:305: warning: type defaults to ‘int’ in declaration of ‘clockid_t’
include/linux/hrtimer.h:305: error: expected ‘;’, ‘,’ or ‘)’ before ‘clockid’
In file included from include/linux/sched.h:91,
from include/linux/interrupt.h:12,
from /tmp/vbox.4/r0drv/linux/the-linux-kernel.h:74,
from /tmp/vbox.4/linux/SUPDrv-linux.c:23:
include/linux/hrtimer.h:317:5: warning: "BITS_PER_LONG" is not defined
include/linux/hrtimer.h:318: error: expected declaration specifiers or ‘...’ before ‘s64’
In file included from include/linux/interrupt.h:12,
from /tmp/vbox.4/r0drv/linux/the-linux-kernel.h:74,
from /tmp/vbox.4/linux/SUPDrv-linux.c:23:
include/linux/sched.h:132: error: expected declaration specifiers or ‘...’ before ‘process_counts’
include/linux/sched.h:132: warning: data definition has no type or storage class
include/linux/sched.h:132: warning: type defaults to ‘int’ in declaration of ‘DECLARE_PER_CPU’
include/linux/sched.h:132: error: conflicting types for ‘DECLARE_PER_CPU’
include/linux/rcupdate.h:114: error: previous declaration of ‘DECLARE_PER_CPU’ was here
In file included from include/linux/aio.h:5,
from include/linux/sched.h:301,
from include/linux/interrupt.h:12,
from /tmp/vbox.4/r0drv/linux/the-linux-kernel.h:74,
from /tmp/vbox.4/linux/SUPDrv-linux.c:23:
include/linux/workqueue.h:25: error: expected specifier-qualifier-list before ‘atomic_long_t’
include/linux/workqueue.h: In function ‘cancel_delayed_work’:
include/linux/workqueue.h:165: error: ‘struct work_struct’ has no member named ‘data’
In file included from include/linux/aio.h:6,
from include/linux/sched.h:301,
from include/linux/interrupt.h:12,
from /tmp/vbox.4/r0drv/linux/the-linux-kernel.h:74,
from /tmp/vbox.4/linux/SUPDrv-linux.c:23:
include/linux/aio_abi.h: At top level:
include/linux/aio_abi.h:58: error: expected specifier-qualifier-list before ‘__u64’
In file included from include/linux/aio.h:6,
from include/linux/sched.h:301,
from include/linux/interrupt.h:12,
from /tmp/vbox.4/r0drv/linux/the-linux-kernel.h:74,
from /tmp/vbox.4/linux/SUPDrv-linux.c:23:
include/linux/aio_abi.h:69:2: error: #error edit for your odd byteorder.
include/linux/aio_abi.h:80: error: expected specifier-qualifier-list before ‘__u64’
In file included from include/linux/aio.h:7,
from include/linux/sched.h:301,
from include/linux/interrupt.h:12,
from /tmp/vbox.4/r0drv/linux/the-linux-kernel.h:74,
from /tmp/vbox.4/linux/SUPDrv-linux.c:23:
include/linux/uio.h:23: error: expected specifier-qualifier-list before ‘__kernel_size_t’
include/linux/uio.h: In function ‘iov_length’:
include/linux/uio.h:60: error: ‘const struct iovec’ has no member named ‘iov_len’
In file included from include/linux/sched.h:301,
from include/linux/interrupt.h:12,
from /tmp/vbox.4/r0drv/linux/the-linux-kernel.h:74,
from /tmp/vbox.4/linux/SUPDrv-linux.c:23:
include/linux/aio.h: At top level:
include/linux/aio.h:96: error: expected specifier-qualifier-list before ‘ssize_t’
include/linux/aio.h:182: error: expected specifier-qualifier-list before ‘atomic_t’
include/linux/aio.h:209: error: expected ‘=’, ‘,’, ‘;’, ‘asm’ or ‘__attribute__’ before ‘wait_on_sync_kiocb’
include/linux/aio.h: In function ‘list_kiocb’:
include/linux/aio.h:253: error: ‘struct kiocb’ has no member named ‘ki_list’
include/linux/aio.h:253: warning: type defaults to ‘int’ in declaration of ‘__mptr’
include/linux/aio.h:253: warning: initialization from incompatible pointer type
include/linux/aio.h:253: error: ‘struct kiocb’ has no member named ‘ki_list’
In file included from include/linux/interrupt.h:12,
from /tmp/vbox.4/r0drv/linux/the-linux-kernel.h:74,
from /tmp/vbox.4/linux/SUPDrv-linux.c:23:
include/linux/sched.h:313:16: warning: "CONFIG_SPLIT_PTLOCK_CPUS" is not defined
In file included from include/linux/interrupt.h:12,
from /tmp/vbox.4/r0drv/linux/the-linux-kernel.h:74,
from /tmp/vbox.4/linux/SUPDrv-linux.c:23:
include/linux/sched.h: At top level:
include/linux/sched.h:323: error: expected ‘=’, ‘,’, ‘;’, ‘asm’ or ‘__attribute__’ before ‘mm_counter_t’
include/linux/sched.h:363: error: expected specifier-qualifier-list before ‘pgd_t’
include/linux/sched.h:420: error: expected specifier-qualifier-list before ‘atomic_t’
include/linux/sched.h:430: error: expected specifier-qualifier-list before ‘cputime_t’
include/linux/sched.h:442: error: expected specifier-qualifier-list before ‘atomic_t’
include/linux/sched.h:556: error: expected specifier-qualifier-list before ‘atomic_t’
include/linux/sched.h:578: warning: parameter names (without types) in function declaration
include/linux/sched.h:790: error: expected specifier-qualifier-list before ‘atomic_t’
include/linux/sched.h:814: error: expected declaration specifiers or ‘...’ before ‘gid_t’
include/linux/sched.h:878: error: expected specifier-qualifier-list before ‘s64’
include/linux/sched.h:918: error: expected specifier-qualifier-list before ‘atomic_t’
include/linux/sched.h: In function ‘rt_task’:
include/linux/sched.h:1205: error: ‘struct task_struct’ has no member named ‘prio’
include/linux/sched.h: At top level:
include/linux/sched.h:1208: error: expected ‘=’, ‘,’, ‘;’, ‘asm’ or ‘__attribute__’ before ‘process_group’
include/linux/sched.h:1213: error: expected ‘=’, ‘,’, ‘;’, ‘asm’ or ‘__attribute__’ before ‘signal_session’
include/linux/sched.h:1218: error: expected ‘=’, ‘,’, ‘;’, ‘asm’ or ‘__attribute__’ before ‘process_session’
include/linux/sched.h:1223: error: expected declaration specifiers or ‘...’ before ‘pid_t’
include/linux/sched.h: In function ‘set_signal_session’:
include/linux/sched.h:1225: error: ‘struct signal_struct’ has no member named ‘__session’
include/linux/sched.h:1225: error: ‘session’ undeclared (first use in this function)
include/linux/sched.h: In function ‘task_pid’:
include/linux/sched.h:1230: error: ‘struct task_struct’ has no member named ‘pids’
include/linux/sched.h: In function ‘task_tgid’:
include/linux/sched.h:1235: error: ‘struct task_struct’ has no member named ‘group_leader’
include/linux/sched.h: In function ‘task_pgrp’:
include/linux/sched.h:1240: error: ‘struct task_struct’ has no member named ‘group_leader’
include/linux/sched.h: In function ‘task_session’:
include/linux/sched.h:1245: error: ‘struct task_struct’ has no member named ‘group_leader’
include/linux/sched.h: In function ‘pid_alive’:
include/linux/sched.h:1258: error: ‘struct task_struct’ has no member named ‘pids’
include/linux/sched.h: In function ‘is_init’:
include/linux/sched.h:1269: error: ‘struct task_struct’ has no member named ‘pid’
include/linux/sched.h: In function ‘put_task_struct’:
include/linux/sched.h:1281: error: ‘struct task_struct’ has no member named ‘usage’
include/linux/sched.h: In function ‘set_cpus_allowed’:
include/linux/sched.h:1346: error: ‘EINVAL’ undeclared (first use in this function)
include/linux/sched.h: At top level:
include/linux/sched.h:1370: error: expected ‘)’ before ‘delta_ns’
include/linux/sched.h: In function ‘rt_mutex_getprio’:
include/linux/sched.h:1396: error: ‘struct task_struct’ has no member named ‘normal_prio’
include/linux/sched.h: At top level:
include/linux/sched.h:1420: error: field ‘thread_info’ has incomplete type
include/linux/sched.h:1421: error: ‘THREAD_SIZE’ undeclared here (not in a function)
include/linux/sched.h:1441: error: expected ‘)’ before ‘session’
include/linux/sched.h:1444: warning: parameter names (without types) in function declaration
include/linux/sched.h: In function ‘get_uid’:
include/linux/sched.h:1447: error: ‘struct user_struct’ has no member named ‘__count’
include/linux/sched.h: At top level:
include/linux/sched.h:1468: warning: parameter names (without types) in function declaration
include/linux/sched.h:1469: warning: parameter names (without types) in function declaration
include/linux/sched.h:1475: error: expected declaration specifiers or ‘...’ before ‘sigset_t’
include/linux/sched.h:1475: error: expected declaration specifiers or ‘...’ before ‘siginfo_t’
include/linux/sched.h:1477: error: expected declaration specifiers or ‘...’ before ‘sigset_t’
include/linux/sched.h:1477: error: expected declaration specifiers or ‘...’ before ‘siginfo_t’
include/linux/sched.h: In function ‘dequeue_signal_lock’:
include/linux/sched.h:1482: warning: implicit declaration of function ‘local_irq_save’
include/linux/sched.h:1482: error: ‘struct task_struct’ has no member named ‘sighand’
include/linux/sched.h:1483: error: ‘mask’ undeclared (first use in this function)
include/linux/sched.h:1483: error: ‘info’ undeclared (first use in this function)
include/linux/sched.h:1483: error: too many arguments to function ‘dequeue_signal’
include/linux/sched.h:1484: warning: implicit declaration of function ‘local_irq_restore’
include/linux/sched.h:1484: error: ‘struct task_struct’ has no member named ‘sighand’
include/linux/sched.h: At top level:
include/linux/sched.h:1490: error: expected declaration specifiers or ‘...’ before ‘sigset_t’
include/linux/sched.h:1493: warning: ‘struct siginfo’ declared inside parameter list
include/linux/sched.h:1494: warning: ‘struct siginfo’ declared inside parameter list
include/linux/sched.h:1496: warning: ‘struct siginfo’ declared inside parameter list
include/linux/sched.h:1497: warning: ‘struct siginfo’ declared inside parameter list
include/linux/sched.h:1498: warning: ‘struct siginfo’ declared inside parameter list
include/linux/sched.h:1499: warning: ‘struct siginfo’ declared inside parameter list
include/linux/sched.h:1500: error: expected declaration specifiers or ‘...’ before ‘uid_t’
include/linux/sched.h:1500: error: expected declaration specifiers or ‘...’ before ‘uid_t’
include/linux/sched.h:1500: error: expected declaration specifiers or ‘...’ before ‘u32’
include/linux/sched.h:1500: warning: ‘struct siginfo’ declared inside parameter list
include/linux/sched.h:1503: error: expected declaration specifiers or ‘...’ before ‘pid_t’
include/linux/sched.h:1503: warning: ‘struct siginfo’ declared inside parameter list
include/linux/sched.h:1509: error: expected ‘)’ before ‘int’
include/linux/sched.h:1514: warning: ‘struct k_sigaction’ declared inside parameter list
include/linux/sched.h:1515: warning: type defaults to ‘int’ in declaration of ‘stack_t’
include/linux/sched.h:1515: error: expected ‘;’, ‘,’ or ‘)’ before ‘*’ token
include/linux/sched.h:1527: warning: ‘struct siginfo’ declared inside parameter list
include/linux/sched.h: In function ‘on_sig_stack’:
include/linux/sched.h:1536: error: ‘current’ undeclared (first use in this function)
include/linux/sched.h: In function ‘sas_ss_flags’:
include/linux/sched.h:1541: error: ‘current’ undeclared (first use in this function)
include/linux/sched.h:1541: error: ‘SS_DISABLE’ undeclared (first use in this function)
include/linux/sched.h:1542: error: ‘SS_ONSTACK’ undeclared (first use in this function)
include/linux/sched.h: In function ‘mmdrop’:
include/linux/sched.h:1554: error: ‘struct mm_struct’ has no member named ‘mm_count’
include/linux/sched.h: In function ‘has_group_leader_pid’:
include/linux/sched.h:1622: error: ‘struct task_struct’ has no member named ‘pid’
include/linux/sched.h:1622: error: ‘struct task_struct’ has no member named ‘tgid’
include/linux/sched.h: In function ‘next_thread’:
include/linux/sched.h:1627: error: ‘struct task_struct’ has no member named ‘thread_group’
include/linux/sched.h:1627: warning: type defaults to ‘int’ in declaration of ‘__mptr’
include/linux/sched.h:1627: error: ‘const struct task_struct’ has no member named ‘thread_group’
include/linux/sched.h:1627: warning: type defaults to ‘int’ in declaration of ‘_________p1’
include/linux/sched.h:1627: error: ‘const struct task_struct’ has no member named ‘thread_group’
include/linux/sched.h:1627: warning: implicit declaration of function ‘smp_read_barrier_depends’
include/linux/sched.h:1627: warning: initialization makes pointer from integer without a cast
include/linux/sched.h:1627: error: ‘struct task_struct’ has no member named ‘thread_group’
include/linux/sched.h: In function ‘thread_group_empty’:
include/linux/sched.h:1633: error: ‘struct task_struct’ has no member named ‘thread_group’
include/linux/sched.h: In function ‘task_lock’:
include/linux/sched.h:1650: error: ‘struct task_struct’ has no member named ‘alloc_lock’
include/linux/sched.h: In function ‘task_unlock’:
include/linux/sched.h:1655: error: ‘struct task_struct’ has no member named ‘alloc_lock’
include/linux/sched.h: In function ‘unlock_task_sighand’:
include/linux/sched.h:1664: error: ‘struct task_struct’ has no member named ‘sighand’
include/linux/sched.h: In function ‘setup_thread_stack’:
include/linux/sched.h:1674: error: dereferencing pointer to incomplete type
include/linux/sched.h:1674: error: dereferencing pointer to incomplete type
include/linux/sched.h:1675: error: dereferencing pointer to incomplete type
include/linux/sched.h: In function ‘end_of_stack’:
include/linux/sched.h:1680: error: invalid use of undefined type ‘struct thread_info’
include/linux/sched.h: In function ‘set_tsk_thread_flag’:
include/linux/sched.h:1690: warning: passing argument 1 of ‘set_ti_thread_flag’ from incompatible pointer type
include/linux/sched.h: In function ‘clear_tsk_thread_flag’:
include/linux/sched.h:1695: warning: passing argument 1 of ‘clear_ti_thread_flag’ from incompatible pointer type
include/linux/sched.h: In function ‘test_and_set_tsk_thread_flag’:
include/linux/sched.h:1700: warning: passing argument 1 of ‘test_and_set_ti_thread_flag’ from incompatible pointer type
include/linux/sched.h: In function ‘test_and_clear_tsk_thread_flag’:
include/linux/sched.h:1705: warning: passing argument 1 of ‘test_and_clear_ti_thread_flag’ from incompatible pointer type
include/linux/sched.h: In function ‘test_tsk_thread_flag’:
include/linux/sched.h:1710: warning: passing argument 1 of ‘test_ti_thread_flag’ from incompatible pointer type
include/linux/sched.h: In function ‘set_tsk_need_resched’:
include/linux/sched.h:1715: error: ‘TIF_NEED_RESCHED’ undeclared (first use in this function)
include/linux/sched.h: In function ‘clear_tsk_need_resched’:
include/linux/sched.h:1720: error: ‘TIF_NEED_RESCHED’ undeclared (first use in this function)
include/linux/sched.h: In function ‘signal_pending’:
include/linux/sched.h:1725: error: ‘TIF_SIGPENDING’ undeclared (first use in this function)
include/linux/sched.h: In function ‘need_resched’:
include/linux/sched.h:1730: error: ‘TIF_NEED_RESCHED’ undeclared (first use in this function)
include/linux/sched.h:1730: warning: passing argument 1 of ‘test_ti_thread_flag’ makes pointer from integer without a cast
include/linux/sched.h: In function ‘arch_pick_mmap_layout’:
include/linux/sched.h:1806: error: ‘TASK_UNMAPPED_BASE’ undeclared (first use in this function)
include/linux/sched.h: At top level:
include/linux/sched.h:1812: error: expected ‘)’ before ‘pid’
include/linux/sched.h:1813: error: expected ‘)’ before ‘pid’
include/linux/sched.h:1840: error: expected declaration specifiers or ‘...’ before ‘ssize_t’
include/linux/sched.h:1844: error: expected declaration specifiers or ‘...’ before ‘ssize_t’
In file included from /tmp/vbox.4/r0drv/linux/the-linux-kernel.h:74,
from /tmp/vbox.4/linux/SUPDrv-linux.c:23:
include/linux/interrupt.h: In function ‘cli’:
include/linux/interrupt.h:222: warning: implicit declaration of function ‘local_irq_disable’
include/linux/interrupt.h: In function ‘sti’:
include/linux/interrupt.h:226: warning: implicit declaration of function ‘local_irq_enable’
include/linux/interrupt.h: In function ‘save_flags’:
include/linux/interrupt.h:230: warning: implicit declaration of function ‘local_save_flags’
include/linux/interrupt.h: At top level:
include/linux/interrupt.h:317: error: expected specifier-qualifier-list before ‘atomic_t’
include/linux/interrupt.h: In function ‘tasklet_disable_nosync’:
include/linux/interrupt.h:376: error: ‘struct tasklet_struct’ has no member named ‘count’
include/linux/interrupt.h:377: warning: implicit declaration of function ‘smp_mb__after_atomic_inc’
include/linux/interrupt.h: In function ‘tasklet_enable’:
include/linux/interrupt.h:389: warning: implicit declaration of function ‘smp_mb__before_atomic_dec’
include/linux/interrupt.h:390: error: ‘struct tasklet_struct’ has no member named ‘count’
include/linux/interrupt.h: In function ‘tasklet_hi_enable’:
include/linux/interrupt.h:396: error: ‘struct tasklet_struct’ has no member named ‘count’
In file included from /tmp/vbox.4/r0drv/linux/the-linux-kernel.h:81,
from /tmp/vbox.4/linux/SUPDrv-linux.c:23:
include/linux/vmalloc.h: At top level:
include/linux/vmalloc.h:45: error: expected declaration specifiers or ‘...’ before ‘pgprot_t’
include/linux/vmalloc.h:47: error: expected declaration specifiers or ‘...’ before ‘pgprot_t’
include/linux/vmalloc.h:51: error: expected declaration specifiers or ‘...’ before ‘pgprot_t’
include/linux/vmalloc.h:68: error: expected declaration specifiers or ‘...’ before ‘pgprot_t’
In file included from /tmp/vbox.4/r0drv/linux/the-linux-kernel.h:83,
from /tmp/vbox.4/linux/SUPDrv-linux.c:23:
include/linux/nls.h:7: error: expected ‘=’, ‘,’, ‘;’, ‘asm’ or ‘__attribute__’ before ‘linux_wchar_t’
include/linux/nls.h:12: error: expected ‘)’ before ‘uni’
include/linux/nls.h:13: error: expected ‘;’ before ‘int’
include/linux/nls.h:31: error: expected ‘)’ before ‘*’ token
include/linux/nls.h:32: error: expected ‘)’ before ‘*’ token
include/linux/nls.h:33: error: expected ‘)’ before ‘*’ token
include/linux/nls.h:34: error: expected ‘)’ before ‘*’ token
include/linux/nls.h: In function ‘nls_tolower’:
include/linux/nls.h:38: error: ‘struct nls_table’ has no member named ‘charset2lower’
include/linux/nls.h: In function ‘nls_toupper’:
include/linux/nls.h:45: error: ‘struct nls_table’ has no member named ‘charset2upper’
In file included from /tmp/vbox.4/linux/SUPDrv-linux.c:23:
/tmp/vbox.4/r0drv/linux/the-linux-kernel.h:85:22: error: asm/mman.h: No such file or directory
/tmp/vbox.4/r0drv/linux/the-linux-kernel.h:86:20: error: asm/io.h: No such file or directory
/tmp/vbox.4/r0drv/linux/the-linux-kernel.h:90:5: warning: "LINUX_VERSION_CODE" is not defined
/tmp/vbox.4/r0drv/linux/the-linux-kernel.h:90:26: warning: "KERNEL_VERSION" is not defined
/tmp/vbox.4/r0drv/linux/the-linux-kernel.h:90:40: error: missing binary operator before token "("
/tmp/vbox.4/r0drv/linux/the-linux-kernel.h:103:5: warning: "LINUX_VERSION_CODE" is not defined
/tmp/vbox.4/r0drv/linux/the-linux-kernel.h:103:26: warning: "KERNEL_VERSION" is not defined
/tmp/vbox.4/r0drv/linux/the-linux-kernel.h:103:40: error: missing binary operator before token "("
/tmp/vbox.4/r0drv/linux/the-linux-kernel.h:172:6: warning: "LINUX_VERSION_CODE" is not defined
/tmp/vbox.4/r0drv/linux/the-linux-kernel.h:172:27: warning: "KERNEL_VERSION" is not defined
/tmp/vbox.4/r0drv/linux/the-linux-kernel.h:172:41: error: missing binary operator before token "("
/tmp/vbox.4/r0drv/linux/the-linux-kernel.h:179:6: warning: "LINUX_VERSION_CODE" is not defined
/tmp/vbox.4/r0drv/linux/the-linux-kernel.h:179:27: warning: "KERNEL_VERSION" is not defined
/tmp/vbox.4/r0drv/linux/the-linux-kernel.h:179:41: error: missing binary operator before token "("
In file included from /tmp/vbox.4/linux/SUPDrv-linux.c:30:
/tmp/vbox.4/include/iprt/process.h: At top level:
/tmp/vbox.4/include/iprt/process.h:83: warning: data definition has no type or storage class
/tmp/vbox.4/include/iprt/process.h:83: warning: type defaults to ‘int’ in declaration of ‘RTPROCESS’
/tmp/vbox.4/include/iprt/process.h:83: warning: ‘cdecl’ attribute only applies to function types
/tmp/vbox.4/include/iprt/process.h:83: warning: ‘regparm’ attribute only applies to function types
/tmp/vbox.4/include/iprt/process.h:83: error: expected ‘,’ or ‘;’ before ‘RTProcSelf’
/tmp/vbox.4/include/iprt/process.h:92: warning: data definition has no type or storage class
/tmp/vbox.4/include/iprt/process.h:92: warning: type defaults to ‘int’ in declaration of ‘RTR0PROCESS’
/tmp/vbox.4/include/iprt/process.h:92: warning: ‘cdecl’ attribute only applies to function types
/tmp/vbox.4/include/iprt/process.h:92: warning: ‘regparm’ attribute only applies to function types
/tmp/vbox.4/include/iprt/process.h:92: error: expected ‘,’ or ‘;’ before ‘RTR0ProcHandleSelf’
In file included from /tmp/vbox.4/linux/SUPDrv-linux.c:32:
/tmp/vbox.4/include/iprt/mem.h:232: error: expected ‘)’ before ‘pPhys’
/tmp/vbox.4/linux/SUPDrv-linux.c:49:5: warning: "LINUX_VERSION_CODE" is not defined
/tmp/vbox.4/linux/SUPDrv-linux.c:49:26: warning: "KERNEL_VERSION" is not defined
/tmp/vbox.4/linux/SUPDrv-linux.c:49:40: error: missing binary operator before token "("
/tmp/vbox.4/linux/SUPDrv-linux.c:118:6: warning: "LINUX_VERSION_CODE" is not defined
/tmp/vbox.4/linux/SUPDrv-linux.c:118:27: warning: "KERNEL_VERSION" is not defined
/tmp/vbox.4/linux/SUPDrv-linux.c:118:41: error: missing binary operator before token "("
/tmp/vbox.4/linux/SUPDrv-linux.c:125:6: warning: "LINUX_VERSION_CODE" is not defined
/tmp/vbox.4/linux/SUPDrv-linux.c:125:27: warning: "KERNEL_VERSION" is not defined
/tmp/vbox.4/linux/SUPDrv-linux.c:125:41: error: missing binary operator before token "("
/tmp/vbox.4/linux/SUPDrv-linux.c:168:5: warning: "HZ" is not defined
/tmp/vbox.4/linux/SUPDrv-linux.c:315: error: unknown field ‘open’ specified in initializer
/tmp/vbox.4/linux/SUPDrv-linux.c:315: warning: excess elements in struct initializer
/tmp/vbox.4/linux/SUPDrv-linux.c:315: warning: (near initialization for ‘gFileOpsVBoxDrv’)
/tmp/vbox.4/linux/SUPDrv-linux.c:316: error: unknown field ‘release’ specified in initializer
/tmp/vbox.4/linux/SUPDrv-linux.c:316: warning: excess elements in struct initializer
/tmp/vbox.4/linux/SUPDrv-linux.c:316: warning: (near initialization for ‘gFileOpsVBoxDrv’)
/tmp/vbox.4/linux/SUPDrv-linux.c:318: error: unknown field ‘unlocked_ioctl’ specified in initializer
/tmp/vbox.4/linux/SUPDrv-linux.c:318: warning: excess elements in struct initializer
/tmp/vbox.4/linux/SUPDrv-linux.c:318: warning: (near initialization for ‘gFileOpsVBoxDrv’)
/tmp/vbox.4/linux/SUPDrv-linux.c:331:6: warning: "LINUX_VERSION_CODE" is not defined
/tmp/vbox.4/linux/SUPDrv-linux.c:331:28: warning: "KERNEL_VERSION" is not defined
/tmp/vbox.4/linux/SUPDrv-linux.c:331:42: error: missing binary operator before token "("
/tmp/vbox.4/linux/SUPDrv-linux.c: In function ‘VBoxSupDrvInit’:
/tmp/vbox.4/linux/SUPDrv-linux.c:676: error: ‘SUPDRVDEVEXT’ has no member named ‘pGip’
/tmp/vbox.4/linux/SUPDrv-linux.c:685: error: ‘EINVAL’ undeclared (first use in this function)
/tmp/vbox.4/linux/SUPDrv-linux.c: In function ‘VBoxSupDrvCreate’:
/tmp/vbox.4/linux/SUPDrv-linux.c:768: error: ‘struct SUPDRVSESSION’ has no member named ‘Uid’
/tmp/vbox.4/linux/SUPDrv-linux.c:768: error: ‘current’ undeclared (first use in this function)
/tmp/vbox.4/linux/SUPDrv-linux.c:769: error: ‘struct SUPDRVSESSION’ has no member named ‘Gid’
/tmp/vbox.4/linux/SUPDrv-linux.c:770: error: ‘struct SUPDRVSESSION’ has no member named ‘Process’
/tmp/vbox.4/linux/SUPDrv-linux.c:770: warning: implicit declaration of function ‘RTProcSelf’
/tmp/vbox.4/linux/SUPDrv-linux.c:771: error: ‘struct SUPDRVSESSION’ has no member named ‘R0Process’
/tmp/vbox.4/linux/SUPDrv-linux.c:771: warning: implicit declaration of function ‘RTR0ProcHandleSelf’
/tmp/vbox.4/linux/SUPDrv-linux.c:775: error: ‘struct file’ has no member named ‘private_data’
/tmp/vbox.4/linux/SUPDrv-linux.c: In function ‘VBoxSupDrvClose’:
/tmp/vbox.4/linux/SUPDrv-linux.c:790: error: ‘struct file’ has no member named ‘private_data’
/tmp/vbox.4/linux/SUPDrv-linux.c:791: error: ‘struct file’ has no member named ‘private_data’
/tmp/vbox.4/linux/SUPDrv-linux.c: In function ‘VBoxSupDrvIOCtl’:
/tmp/vbox.4/linux/SUPDrv-linux.c:817: error: ‘struct file’ has no member named ‘private_data’
/tmp/vbox.4/linux/SUPDrv-linux.c: In function ‘VBoxSupDrvIOCtlSlow’:
/tmp/vbox.4/linux/SUPDrv-linux.c:856: warning: implicit declaration of function ‘_IOC_SIZE’
/tmp/vbox.4/linux/SUPDrv-linux.c:859: error: ‘EINVAL’ undeclared (first use in this function)
/tmp/vbox.4/linux/SUPDrv-linux.c:861: warning: implicit declaration of function ‘copy_from_user’
/tmp/vbox.4/linux/SUPDrv-linux.c:864: error: ‘EFAULT’ undeclared (first use in this function)
/tmp/vbox.4/linux/SUPDrv-linux.c:877: error: ‘ENOMEM’ undeclared (first use in this function)
/tmp/vbox.4/linux/SUPDrv-linux.c:891: error: ‘struct file’ has no member named ‘private_data’
/tmp/vbox.4/linux/SUPDrv-linux.c:907: warning: implicit declaration of function ‘copy_to_user’
/tmp/vbox.4/linux/SUPDrv-linux.c:916: error: ‘EPERM’ undeclared (first use in this function)
/tmp/vbox.4/linux/SUPDrv-linux.c: In function ‘VBoxSupDrvInitGip’:
/tmp/vbox.4/linux/SUPDrv-linux.c:1540: error: ‘dma_addr_t’ undeclared (first use in this function)
/tmp/vbox.4/linux/SUPDrv-linux.c:1540: error: expected ‘;’ before ‘HCPhys’
/tmp/vbox.4/linux/SUPDrv-linux.c:1541: warning: ISO C90 forbids mixed declarations and code
/tmp/vbox.4/linux/SUPDrv-linux.c:1554: error: ‘ENOMEM’ undeclared (first use in this function)
/tmp/vbox.4/linux/SUPDrv-linux.c:1566: error: ‘HCPhys’ undeclared (first use in this function)
/tmp/vbox.4/linux/SUPDrv-linux.c:1566: warning: implicit declaration of function ‘page_to_phys’
/tmp/vbox.4/linux/SUPDrv-linux.c:1568: error: ‘struct SUPDRVDEVEXT’ has no member named ‘ulLastJiffies’
/tmp/vbox.4/linux/SUPDrv-linux.c:1570: error: ‘struct SUPDRVDEVEXT’ has no member named ‘u64LastMonotime’
/tmp/vbox.4/linux/SUPDrv-linux.c:1570: error: expected ‘;’ before ‘pDevExt’
/tmp/vbox.4/linux/SUPDrv-linux.c:1578: error: ‘struct SUPDRVDEVEXT’ has no member named ‘u64LastMonotime’
/tmp/vbox.4/linux/SUPDrv-linux.c:1579: error: ‘HZ’ undeclared (first use in this function)
/tmp/vbox.4/linux/SUPDrv-linux.c:1579: error: too many arguments to function ‘supdrvGipInit’
/tmp/vbox.4/linux/SUPDrv-linux.c: In function ‘VBoxSupDrvTermGip’:
/tmp/vbox.4/linux/SUPDrv-linux.c:1626: error: ‘struct SUPDRVDEVEXT’ has no member named ‘pGip’
/tmp/vbox.4/linux/SUPDrv-linux.c:1627: error: ‘struct SUPDRVDEVEXT’ has no member named ‘pGip’
/tmp/vbox.4/linux/SUPDrv-linux.c: In function ‘VBoxSupGipTimer’:
/tmp/vbox.4/linux/SUPDrv-linux.c:1663: warning: statement with no effect
/tmp/vbox.4/linux/SUPDrv-linux.c:1663: error: expected ‘;’ before ‘u64Monotime’
/tmp/vbox.4/linux/SUPDrv-linux.c:1664: warning: ISO C90 forbids mixed declarations and code
/tmp/vbox.4/linux/SUPDrv-linux.c:1678: error: ‘struct SUPDRVDEVEXT’ has no member named ‘pGip’
/tmp/vbox.4/linux/SUPDrv-linux.c:1696: error: ‘struct SUPDRVDEVEXT’ has no member named ‘ulLastJiffies’
/tmp/vbox.4/linux/SUPDrv-linux.c:1697: error: ‘struct SUPDRVDEVEXT’ has no member named ‘ulLastJiffies’
/tmp/vbox.4/linux/SUPDrv-linux.c:1699: error: ‘u64Monotime’ undeclared (first use in this function)
/tmp/vbox.4/linux/SUPDrv-linux.c:1699: error: ‘struct SUPDRVDEVEXT’ has no member named ‘u64LastMonotime’
/tmp/vbox.4/linux/SUPDrv-linux.c:1699: error: ‘CLOCK_TICK_RATE’ undeclared (first use in this function)
/tmp/vbox.4/linux/SUPDrv-linux.c:1699: error: ‘HZ’ undeclared (first use in this function)
/tmp/vbox.4/linux/SUPDrv-linux.c:1703: error: ‘struct SUPDRVDEVEXT’ has no member named ‘u64LastMonotime’
/tmp/vbox.4/linux/SUPDrv-linux.c:1706: error: ‘struct SUPDRVDEVEXT’ has no member named ‘pGip’
/tmp/vbox.4/linux/SUPDrv-linux.c:1706: error: too many arguments to function ‘supdrvGipUpdate’
/tmp/vbox.4/linux/SUPDrv-linux.c:1707: error: ‘struct SUPDRVDEVEXT’ has no member named ‘fGIPSuspended’
/tmp/vbox.4/linux/SUPDrv-linux.c: In function ‘supdrvOSGipMap’:
/tmp/vbox.4/linux/SUPDrv-linux.c:1808: error: ‘struct SUPDRVDEVEXT’ has no member named ‘HCPhysGip’
/tmp/vbox.4/linux/SUPDrv-linux.c:1809: error: ‘pgprot_t’ undeclared (first use in this function)
/tmp/vbox.4/linux/SUPDrv-linux.c:1809: error: expected ‘;’ before ‘pgFlags’
/tmp/vbox.4/linux/SUPDrv-linux.c:1810: error: ‘pgFlags’ undeclared (first use in this function)
/tmp/vbox.4/linux/SUPDrv-linux.c:1810: error: ‘_PAGE_PRESENT’ undeclared (first use in this function)
/tmp/vbox.4/linux/SUPDrv-linux.c:1810: error: ‘_PAGE_USER’ undeclared (first use in this function)
/tmp/vbox.4/linux/SUPDrv-linux.c:1816: error: ‘current’ undeclared (first use in this function)
/tmp/vbox.4/linux/SUPDrv-linux.c:1817: error: ‘PAGE_SIZE’ undeclared (first use in this function)
/tmp/vbox.4/linux/SUPDrv-linux.c:1817: error: ‘PROT_READ’ undeclared (first use in this function)
/tmp/vbox.4/linux/SUPDrv-linux.c:1817: error: ‘MAP_SHARED’ undeclared (first use in this function)
/tmp/vbox.4/linux/SUPDrv-linux.c:1817: error: ‘MAP_ANONYMOUS’ undeclared (first use in this function)
/tmp/vbox.4/linux/SUPDrv-linux.c:1818: error: ‘PAGE_MASK’ undeclared (first use in this function)
/tmp/vbox.4/linux/SUPDrv-linux.c:1820:5: warning: "LINUX_VERSION_CODE" is not defined
/tmp/vbox.4/linux/SUPDrv-linux.c:1820:26: warning: "KERNEL_VERSION" is not defined
/tmp/vbox.4/linux/SUPDrv-linux.c:1820:40: error: missing binary operator before token "("
/tmp/vbox.4/linux/SUPDrv-linux.c:1826:5: warning: "LINUX_VERSION_CODE" is not defined
/tmp/vbox.4/linux/SUPDrv-linux.c:1826:26: warning: "KERNEL_VERSION" is not defined
/tmp/vbox.4/linux/SUPDrv-linux.c:1826:40: error: missing binary operator before token "("
/tmp/vbox.4/linux/SUPDrv-linux.c:1829: error: ‘PAGE_SHIFT’ undeclared (first use in this function)
/tmp/vbox.4/linux/SUPDrv-linux.c:1829: error: too many arguments to function ‘remap_pfn_range’
/tmp/vbox.4/linux/SUPDrv-linux.c: In function ‘supdrvOSGipUnmap’:
/tmp/vbox.4/linux/SUPDrv-linux.c:1884: error: ‘current’ undeclared (first use in this function)
/tmp/vbox.4/linux/SUPDrv-linux.c:1887: error: ‘PAGE_SIZE’ undeclared (first use in this function)
/tmp/vbox.4/linux/SUPDrv-linux.c: In function ‘supdrvOSGipResume’:
/tmp/vbox.4/linux/SUPDrv-linux.c:1903: error: ‘struct SUPDRVDEVEXT’ has no member named ‘fGIPSuspended’
/tmp/vbox.4/linux/SUPDrv-linux.c: In function ‘supdrvOSGipSuspend’:
/tmp/vbox.4/linux/SUPDrv-linux.c:1957: error: ‘struct SUPDRVDEVEXT’ has no member named ‘fGIPSuspended’
/tmp/vbox.4/linux/SUPDrv-linux.c: In function ‘VBoxSupDrvErr2LinuxErr’:
/tmp/vbox.4/linux/SUPDrv-linux.c:2007: error: ‘EACCES’ undeclared (first use in this function)
/tmp/vbox.4/linux/SUPDrv-linux.c:2008: error: ‘EINVAL’ undeclared (first use in this function)
/tmp/vbox.4/linux/SUPDrv-linux.c:2009: error: ‘EILSEQ’ undeclared (first use in this function)
/tmp/vbox.4/linux/SUPDrv-linux.c:2010: error: ‘ENXIO’ undeclared (first use in this function)
/tmp/vbox.4/linux/SUPDrv-linux.c:2011: error: ‘EFAULT’ undeclared (first use in this function)
/tmp/vbox.4/linux/SUPDrv-linux.c:2012: error: ‘ENOLCK’ undeclared (first use in this function)
/tmp/vbox.4/linux/SUPDrv-linux.c:2013: error: ‘EEXIST’ undeclared (first use in this function)
/tmp/vbox.4/linux/SUPDrv-linux.c:2014: error: ‘EPERM’ undeclared (first use in this function)
/tmp/vbox.4/linux/SUPDrv-linux.c:2015: error: ‘ENOSYS’ undeclared (first use in this function)
/tmp/vbox.4/linux/SUPDrv-linux.c:2083:5: warning: "LINUX_VERSION_CODE" is not defined
/tmp/vbox.4/linux/SUPDrv-linux.c:2083:27: warning: "KERNEL_VERSION" is not defined
/tmp/vbox.4/linux/SUPDrv-linux.c:2083:41: error: missing binary operator before token "("
/tmp/vbox.4/linux/SUPDrv-linux.c: At top level:
/tmp/vbox.4/linux/SUPDrv-linux.c:2086: error: expected ‘)’ before string constant
make[2]: *** [/tmp/vbox.4/linux/SUPDrv-linux.o] Error 1
make[1]: *** [_module_/tmp/vbox.4] Error 2
make[1]: Leaving directory `/usr/src/linux-2.6.22.9-laptop-1mdv'
make: *** [vboxdrv] Error 2