All pastes #950616 Raw Edit

Stuff

public text v1 · immutable
·published 2008-03-20 18:36 UTC
rendered paste body
OTE:   /busybox/bin/sync
NOTE:   /busybox/bin/mkdir
NOTE: package busybox-1.9.1-r4: task do_package: completed
NOTE: package busybox-1.9.1: completed
NOTE: Running task 505 of 683 (ID: 164, /home/ido/slug/slugos/openembedded/packages/linux/linux-ixp4xx_2.6.24.bb, do_deploy)
NOTE: package linux-ixp4xx-2.6.24+svnr1039: started
NOTE: package linux-ixp4xx-2.6.24+svnr1039-r1: task do_deploy: started
NOTE: package linux-ixp4xx-2.6.24+svnr1039-r1: task do_deploy: completed
NOTE: package linux-ixp4xx-2.6.24+svnr1039: completed
NOTE: Running task 506 of 683 (ID: 96, /home/ido/slug/slugos/openembedded/packages/ixp4xx/ixp4xx-npe_2.4.bb, do_patch)
NOTE: package ixp4xx-npe-2.4: started
NOTE: package ixp4xx-npe-2.4-r1: task do_patch: started
NOTE: package ixp4xx-npe-2.4-r1: task do_patch: completed
NOTE: package ixp4xx-npe-2.4: completed
NOTE: Running task 507 of 683 (ID: 94, /home/ido/slug/slugos/openembedded/packages/ixp4xx/ixp4xx-npe_2.4.bb, do_configure)
NOTE: package ixp4xx-npe-2.4: started
NOTE: package ixp4xx-npe-2.4-r1: task do_configure: started
NOTE: package ixp4xx-npe-2.4-r1: task do_configure: completed
NOTE: package ixp4xx-npe-2.4: completed
NOTE: Running task 508 of 683 (ID: 95, /home/ido/slug/slugos/openembedded/packages/ixp4xx/ixp4xx-npe_2.4.bb, do_compile)
NOTE: package ixp4xx-npe-2.4: started
NOTE: package ixp4xx-npe-2.4-r1: task do_compile: started
NOTE: package ixp4xx-npe-2.4-r1: task do_compile: completed
NOTE: package ixp4xx-npe-2.4: completed
NOTE: Running task 509 of 683 (ID: 99, /home/ido/slug/slugos/openembedded/packages/ixp4xx/ixp4xx-npe_2.4.bb, do_install)
NOTE: package ixp4xx-npe-2.4: started
NOTE: package ixp4xx-npe-2.4-r1: task do_install: started
ERROR: function do_install failed
ERROR: see log in /home/ido/slug/slugos/tmp/work/armv5te-linux/ixp4xx-npe-2.4-r1/temp/log.do_install.24392
NOTE: Task failed: /home/ido/slug/slugos/tmp/work/armv5te-linux/ixp4xx-npe-2.4-r1/temp/log.do_install.24392
NOTE: package ixp4xx-npe-2.4-r1: task do_install: failed
ERROR: TaskFailed event exception, aborting
NOTE: package ixp4xx-npe-2.4: failed
ERROR: Build of /home/ido/slug/slugos/openembedded/packages/ixp4xx/ixp4xx-npe_2.4.bb do_install failed
ERROR: Task 99 (/home/ido/slug/slugos/openembedded/packages/ixp4xx/ixp4xx-npe_2.4.bb, do_install) failed
NOTE: Tasks Summary: Attempted 508 tasks of which 319 didn't need to be rerun and 1failed.
NOTE: Runtime target 'ixp4xx-npe' is unbuildable, removing...
Missing or unbuildable dependency chain was: ['ixp4xx-npe', 10]
NOTE: Runtime target 'task-slugos' is unbuildable, removing...
Missing or unbuildable dependency chain was: ['task-slugos', 'ixp4xx-npe', 10]
NOTE: Preparing runqueue
Traceback (most recent call last):
  File "/home/ido/slug/slugos/bitbake/bin/bitbake", line 134, in <module>
    main()
  File "/home/ido/slug/slugos/bitbake/bin/bitbake", line 131, in main
    cooker.cook()
  File "/home/ido/slug/slugos/bitbake/lib/bb/cooker.py", line 601, in cook
    return self.buildTargets(pkgs_to_build)
  File "/home/ido/slug/slugos/bitbake/lib/bb/cooker.py", line 517, in buildTargets
    failures = rq.execute_runqueue()
  File "/home/ido/slug/slugos/bitbake/lib/bb/runqueue.py", line 663, in execute_runqueue
    self.prepare_runqueue()
  File "/home/ido/slug/slugos/bitbake/lib/bb/runqueue.py", line 385, in prepare_runqueue
    depdata = taskData.build_targets[depid][0]
IndexError: list index out of range
make[1]: *** [image] Error 1
make[1]: Leaving directory `/home/ido/slug/slugos'
make: *** [slugosle] Error 2