checking for FT_GlyphSlot_Embolden in -lfreetype... yes
checking which libxslt to use... external
checking for libxslt ... yes
checking LIBXSLT_CFLAGS... -I/usr/include/libxml2
checking LIBXSLT_LIBS... -lxslt -lxml2 -lz -lm
checking for xsltproc... /usr/bin/xsltproc
checking which libxml to use... external
checking for libxml-2.0 >= 2.0 ... yes
checking LIBXML_CFLAGS... -I/usr/include/libxml2
checking LIBXML_LIBS... -lxml2 -lz -lm
checking which python to use... external
checking for a Python interpreter with version >= 2.2... python
checking for python... /usr/local/bin/python
checking for python version... 'import site' failed; use -v for traceback
2.4
checking for python platform... 'import site' failed; use -v for traceback
linux2
checking for python script directory... ${prefix}/lib/python2.4/site-packages
checking for python extension module directory... ${exec_prefix}/lib/python2.4/site-packages
'import site' failed; use -v for traceback
Traceback (most recent call last):
File "<string>", line 1, in ?
File "/usr/lib/python2.5/distutils/sysconfig.py", line 531, in get_config_var
return get_config_vars().get(name)
File "/usr/lib/python2.5/distutils/sysconfig.py", line 493, in get_config_vars
func()
File "/usr/lib/python2.5/distutils/sysconfig.py", line 345, in _init_posix
filename = get_makefile_filename()
File "/usr/lib/python2.5/distutils/sysconfig.py", line 203, in get_makefile_filename
lib_dir = get_python_lib(plat_specific=1, standard_lib=1)
File "/usr/lib/python2.5/distutils/sysconfig.py", line 103, in get_python_lib
sys.lib, "python" + get_python_version())
AttributeError: 'module' object has no attribute 'lib'
'import site' failed; use -v for traceback
Traceback (most recent call last):
File "<string>", line 1, in ?
File "/usr/lib/python2.5/distutils/sysconfig.py", line 531, in get_config_var
return get_config_vars().get(name)
File "/usr/lib/python2.5/distutils/sysconfig.py", line 493, in get_config_vars
func()
File "/usr/lib/python2.5/distutils/sysconfig.py", line 345, in _init_posix
filename = get_makefile_filename()
File "/usr/lib/python2.5/distutils/sysconfig.py", line 203, in get_makefile_filename
lib_dir = get_python_lib(plat_specific=1, standard_lib=1)
File "/usr/lib/python2.5/distutils/sysconfig.py", line 103, in get_python_lib
sys.lib, "python" + get_python_version())
AttributeError: 'module' object has no attribute 'lib'
checking Python.h usability... no
checking Python.h presence... no
checking for Python.h... no
configure: error: Python headers not found
make: *** [stamp/build] Fehler 1
Dies ist mit export PYTHONPATH=/usr/lib/python2.5/:/usr/bin/python:/usr/include/python2.5/:/usr/lib/python2.5/site-packages/