All pastes #947241 Raw Edit

Something

public text v1 · immutable
·published 2008-03-18 10:45 UTC
rendered paste body
creating libgnashplugin.la
(cd .libs && rm -f libgnashplugin.la && ln -s ../libgnashplugin.la libgnashplugin.la)
make[3]: Leaving directory `/var/tmp/portage/net-www/gnash-99999999/work/gnash/plugin'
make[2]: Leaving directory `/var/tmp/portage/net-www/gnash-99999999/work/gnash/plugin'
Making all in pythonmodule
make[2]: Entering directory `/var/tmp/portage/net-www/gnash-99999999/work/gnash/pythonmodule'
make[2]: Nothing to be done for `all'.
make[2]: Leaving directory `/var/tmp/portage/net-www/gnash-99999999/work/gnash/pythonmodule'
Making all in doc
make[2]: Entering directory `/var/tmp/portage/net-www/gnash-99999999/work/gnash/doc'
Making all in C
make[3]: Entering directory `/var/tmp/portage/net-www/gnash-99999999/work/gnash/doc/C'
WARNING: Linking to preformatted version of gnash.1, it could be out of date.
WARNING: Linking to preformatted version of gprocessor.1, it could be out of date.
WARNING: Linking to preformatted version of dumpshm.1, it could be out of date.
WARNING: Linking to preformatted version of soldumper.1, it could be out of date.
WARNING: Linking to preformatted version of cygnal.1, it could be out of date.
WARNING: Linking to preformatted version of gnash_user.info, it could be out of date.
WARNING: Linking to preformatted version of gnash_ref.info, it could be out of date.
WARNING: Linking to preformatted version of gnashuser.html, it could be out of date.
WARNING: Linking to preformatted version of gnashref.html, it could be out of date.
make[3]: Leaving directory `/var/tmp/portage/net-www/gnash-99999999/work/gnash/doc/C'
make[3]: Entering directory `/var/tmp/portage/net-www/gnash-99999999/work/gnash/doc'
make[3]: Nothing to be done for `all-am'.
make[3]: Leaving directory `/var/tmp/portage/net-www/gnash-99999999/work/gnash/doc'
make[2]: Leaving directory `/var/tmp/portage/net-www/gnash-99999999/work/gnash/doc'
Making all in po
make[2]: Entering directory `/var/tmp/portage/net-www/gnash-99999999/work/gnash/po'
/usr/bin/gmsgfmt --statistics --directory=. -o es.gmo es.po 
/usr/bin/gmsgfmt --statistics --directory=. -o fr.gmo fr.po 
2 translated messages, 2 fuzzy translations, 1101 untranslated messages.
/usr/bin/gmsgfmt --statistics --directory=. -o de.gmo de.po 
8 translated messages, 4 fuzzy translations, 1093 untranslated messages.
/usr/bin/gmsgfmt --statistics --directory=. -o it.gmo it.po 
325 translated messages, 4 fuzzy translations, 776 untranslated messages.
68 translated messages, 36 fuzzy translations, 1001 untranslated messages.
/usr/bin/gmsgfmt --statistics --directory=. -o cs.gmo cs.po 
/usr/bin/gmsgfmt --statistics --directory=. -o sv.gmo sv.po 
103 translated messages, 67 fuzzy translations, 935 untranslated messages.
/usr/bin/gmsgfmt --statistics --directory=. -o fi.gmo fi.po 
479 translated messages, 211 fuzzy translations, 415 untranslated messages.
127 translated messages, 4 fuzzy translations, 974 untranslated messages.
make[2]: Leaving directory `/var/tmp/portage/net-www/gnash-99999999/work/gnash/po'
Making all in cygnal
make[2]: Entering directory `/var/tmp/portage/net-www/gnash-99999999/work/gnash/cygnal'
Making all in testsuite
make[3]: Entering directory `/var/tmp/portage/net-www/gnash-99999999/work/gnash/cygnal/testsuite'
Making all in cygnal.all
make[4]: Entering directory `/var/tmp/portage/net-www/gnash-99999999/work/gnash/cygnal/testsuite/cygnal.all'
make[4]: Nothing to be done for `all'.
make[4]: Leaving directory `/var/tmp/portage/net-www/gnash-99999999/work/gnash/cygnal/testsuite/cygnal.all'
make[4]: Entering directory `/var/tmp/portage/net-www/gnash-99999999/work/gnash/cygnal/testsuite'
make[4]: Nothing to be done for `all-am'.
make[4]: Leaving directory `/var/tmp/portage/net-www/gnash-99999999/work/gnash/cygnal/testsuite'
make[3]: Leaving directory `/var/tmp/portage/net-www/gnash-99999999/work/gnash/cygnal/testsuite'
Making all in .
make[3]: Entering directory `/var/tmp/portage/net-www/gnash-99999999/work/gnash/cygnal'
/bin/sh ../libtool --tag=CXX   --mode=compile x86_64-pc-linux-gnu-g++ -DHAVE_CONFIG_H -I. -I.. -I.. -I.. -I../libamf -I../libbase -I../server -DLOCALEDIR=\"/usr/share/locale\" -I/usr/include/libxml2   -I/usr/X11R6/include -pthread    -march=nocona -O2 -pipe -pthread -pthread     -W     -Wall     -Wcast-align     -Wcast-qual     -Wpointer-arith     -Wreturn-type      -fvisibility-inlines-hidden -MT buffer.lo -MD -MP -MF .deps/buffer.Tpo -c -o buffer.lo buffer.cpp
/bin/sh ../libtool --tag=CXX   --mode=compile x86_64-pc-linux-gnu-g++ -DHAVE_CONFIG_H -I. -I.. -I.. -I.. -I../libamf -I../libbase -I../server -DLOCALEDIR=\"/usr/share/locale\" -I/usr/include/libxml2   -I/usr/X11R6/include -pthread    -march=nocona -O2 -pipe -pthread -pthread     -W     -Wall     -Wcast-align     -Wcast-qual     -Wpointer-arith     -Wreturn-type      -fvisibility-inlines-hidden -MT cque.lo -MD -MP -MF .deps/cque.Tpo -c -o cque.lo cque.cpp
mkdir .libs
 x86_64-pc-linux-gnu-g++ -DHAVE_CONFIG_H -I. -I.. -I.. -I.. -I../libamf -I../libbase -I../server -DLOCALEDIR=\"/usr/share/locale\" -I/usr/include/libxml2 -I/usr/X11R6/include -pthread -march=nocona -O2 -pipe -pthread -pthread -W -Wall -Wcast-align -Wcast-qual -Wpointer-arith -Wreturn-type -fvisibility-inlines-hidden -MT cque.lo -MD -MP -MF .deps/cque.Tpo -c cque.cpp  -fPIC -DPIC -o .libs/cque.o
 x86_64-pc-linux-gnu-g++ -DHAVE_CONFIG_H -I. -I.. -I.. -I.. -I../libamf -I../libbase -I../server -DLOCALEDIR=\"/usr/share/locale\" -I/usr/include/libxml2 -I/usr/X11R6/include -pthread -march=nocona -O2 -pipe -pthread -pthread -W -Wall -Wcast-align -Wcast-qual -Wpointer-arith -Wreturn-type -fvisibility-inlines-hidden -MT buffer.lo -MD -MP -MF .deps/buffer.Tpo -c buffer.cpp  -fPIC -DPIC -o .libs/buffer.o
In file included from buffer.cpp:20:
buffer.h:45: error: ‘class gnash::Network::byte_t’ has not been declared
buffer.h:48: error: type ‘gnash::Network’ is not derived from type ‘cygnal::Buffer’
buffer.h:48: error: expected ‘;’ before ‘*’ token
buffer.h:49: error: expected `;' before ‘size_t’
buffer.h:60: error: type ‘gnash::Network’ is not derived from type ‘cygnal::Buffer’
buffer.h:60: error: expected ‘;’ before ‘operator’
buffer.h:66: error: type ‘gnash::Network’ is not derived from type ‘cygnal::Buffer’
buffer.h:66: error: expected ‘;’ before ‘*’ token
In file included from cque.cpp:28:
buffer.h:45: error: ‘class gnash::Network::byte_t’ has not been declared
buffer.h:48: error: type ‘gnash::Network’ is not derived from type ‘cygnal::Buffer’
buffer.h:48: error: expected ‘;’ before ‘*’ token
buffer.h:49: error: expected `;' before ‘size_t’
buffer.h:60: error: type ‘gnash::Network’ is not derived from type ‘cygnal::Buffer’
buffer.h:60: error: expected ‘;’ before ‘operator’
buffer.h:66: error: type ‘gnash::Network’ is not derived from type ‘cygnal::Buffer’
buffer.h:66: error: expected ‘;’ before ‘*’ token
In file included from cque.cpp:29:
cque.h:39: error: ‘class gnash::Network::byte_t’ has not been declared
cque.cpp:95: error: ‘bool cygnal::CQue::push’ is not a static member of ‘class cygnal::CQue’
cque.cpp:95: error: ‘byte_t’ is not a member of ‘gnash::Network’
cque.cpp:95: error: ‘data’ was not declared in this scope
cque.cpp:95: error: expected primary-expression before ‘int’
cque.cpp:95: error: initializer expression list treated as compound expression
cque.cpp:96: error: expected ‘,’ or ‘;’ before ‘{’ token
cque.cpp: In member function ‘void cygnal::CQue::remove(cygnal::Buffer*, cygnal::Buffer*)’:
cque.cpp:150: error: ‘class cygnal::Buffer’ has no member named ‘reference’
cque.cpp:150: error: ‘class cygnal::Buffer’ has no member named ‘reference’
cque.cpp:153: error: ‘class cygnal::Buffer’ has no member named ‘reference’
cque.cpp:153: error: ‘class cygnal::Buffer’ has no member named ‘reference’
cque.cpp: In member function ‘void cygnal::CQue::remove(cygnal::Buffer*)’:
cque.cpp:170: error: ‘class cygnal::Buffer’ has no member named ‘reference’
cque.cpp:170: error: ‘class cygnal::Buffer’ has no member named ‘reference’
cque.cpp: In member function ‘cygnal::Buffer* cygnal::CQue::merge(cygnal::Buffer*)’:
cque.cpp:192: error: ‘NETBUFSIZE’ is not a member of ‘gnash’
cque.cpp:194: error: ‘byte_t’ is not a member of ‘gnash::Network’
cque.cpp:194: error: ‘tmp’ was not declared in this scope
cque.cpp:194: error: ‘class cygnal::Buffer’ has no member named ‘reference’
cque.cpp:200: error: ‘class cygnal::Buffer’ has no member named ‘reference’
cque.cpp:200: error: ‘class cygnal::Buffer’ has no member named ‘reference’
cque.cpp:209: error: ‘class cygnal::Buffer’ has no member named ‘reference’
cque.cpp:209: error: ‘class cygnal::Buffer’ has no member named ‘reference’
buffer.cpp: In member function ‘void* cygnal::Buffer::init(size_t)’:
buffer.cpp:34: error: ‘_ptr’ was not declared in this scope
buffer.cpp:35: error: expected type-specifier
buffer.cpp:35: error: expected `;'
buffer.cpp:42: error: ‘_ptr’ was not declared in this scope
buffer.cpp: In constructor ‘cygnal::Buffer::Buffer()’:
buffer.cpp:48: error: ‘_ptr’ was not declared in this scope
buffer.cpp:49: error: ‘NETBUFSIZE’ is not a member of ‘gnash’
buffer.cpp:50: error: ‘NETBUFSIZE’ is not a member of ‘gnash’
buffer.cpp: In constructor ‘cygnal::Buffer::Buffer(size_t)’:
buffer.cpp:57: error: ‘_ptr’ was not declared in this scope
buffer.cpp: In destructor ‘cygnal::Buffer::~Buffer()’:
buffer.cpp:66: error: ‘_ptr’ was not declared in this scope
buffer.cpp:67: error: type ‘<type error>’ argument given to ‘delete’, expected pointer
buffer.cpp: At global scope:
buffer.cpp:75: error: variable or field ‘copy’ declared void
buffer.cpp:75: error: ‘byte_t’ is not a member of ‘gnash::Network’
buffer.cpp:75: error: ‘data’ was not declared in this scope
buffer.cpp:75: error: expected primary-expression before ‘int’
buffer.cpp: In member function ‘cygnal::Buffer& cygnal::Buffer::operator=(cygnal::Buffer*)’:
buffer.cpp:86: warning: comparison between signed and unsigned integer expressions
buffer.cpp:90: error: ‘class cygnal::Buffer’ has no member named ‘reference’
buffer.cpp:90: error: ‘class cygnal::Buffer’ has no member named ‘reference’
buffer.cpp:90: error: ‘_ptr’ was not declared in this scope
buffer.cpp: In member function ‘cygnal::Buffer& cygnal::Buffer::operator=(cygnal::Buffer&)’:
buffer.cpp:99: warning: comparison between signed and unsigned integer expressions
buffer.cpp:103: error: ‘class cygnal::Buffer’ has no member named ‘reference’
buffer.cpp:103: error: ‘class cygnal::Buffer’ has no member named ‘reference’
buffer.cpp:103: error: ‘_ptr’ was not declared in this scope
buffer.cpp: In member function ‘bool cygnal::Buffer::operator==(cygnal::Buffer*)’:
buffer.cpp:113: warning: comparison between signed and unsigned integer expressions
buffer.cpp:114: error: ‘class cygnal::Buffer’ has no member named ‘reference’
buffer.cpp:114: error: ‘_ptr’ was not declared in this scope
buffer.cpp: In member function ‘bool cygnal::Buffer::operator==(cygnal::Buffer&)’:
buffer.cpp:125: warning: comparison between signed and unsigned integer expressions
buffer.cpp:126: error: ‘class cygnal::Buffer’ has no member named ‘reference’
buffer.cpp:126: error: ‘_ptr’ was not declared in this scope
buffer.cpp: In member function ‘void cygnal::Buffer::empty()’:
buffer.cpp:138: error: ‘_ptr’ was not declared in this scope
buffer.cpp: In member function ‘void* cygnal::Buffer::resize(size_t)’:
buffer.cpp:149: error: ‘byte_t’ is not a member of ‘gnash::Network’
buffer.cpp:149: error: ‘tmp’ was not declared in this scope
buffer.cpp:149: error: expected type-specifier
buffer.cpp:149: error: expected `;'
buffer.cpp:151: warning: comparison between signed and unsigned integer expressions
buffer.cpp:152: error: ‘_ptr’ was not declared in this scope
buffer.cpp:155: warning: comparison between signed and unsigned integer expressions
buffer.cpp:156: error: ‘_ptr’ was not declared in this scope
buffer.cpp:162: error: ‘_ptr’ was not declared in this scope
buffer.cpp: In member function ‘void cygnal::Buffer::dump()’:
buffer.cpp:173: error: ‘_ptr’ was not declared in this scope
make[3]: *** [cque.lo] Error 1
make[3]: *** Waiting for unfinished jobs....
make[3]: *** [buffer.lo] Error 1
make[3]: Leaving directory `/var/tmp/portage/net-www/gnash-99999999/work/gnash/cygnal'
make[2]: *** [all-recursive] Error 1
make[2]: Leaving directory `/var/tmp/portage/net-www/gnash-99999999/work/gnash/cygnal'
make[1]: *** [all-recursive] Error 1
make[1]: Leaving directory `/var/tmp/portage/net-www/gnash-99999999/work/gnash'
make: *** [all] Error 2
 * 
 * ERROR: net-www/gnash-99999999 failed.
 * Call stack:
 *               ebuild.sh, line   49:  Called src_compile
 *             environment, line 3726:  Called die
 * The specific snippet of code:
 *       emake ${jobs} || die "emake failed"
 *  The die message:
 *   emake failed
 * 
 * If you need support, post the topmost build error, and the call stack if relevant.
 * A complete build log is located at '/var/tmp/portage/net-www/gnash-99999999/temp/build.log'.
 * The ebuild environment file is located at '/var/tmp/portage/net-www/gnash-99999999/temp/environment'.