All pastes #947081 Raw Edit

Untitled

public text v1 · immutable
·published 2008-03-18 04:15 UTC
rendered paste body
[ 86%] Building CXX object engines/potd/CMakeFiles/plasma_potd_flickrprovider.dir/plasma_potd_flickrprovider_automoc.o
/usr/lib/icecc/bin/c++   -Dplasma_potd_flickrprovider_EXPORTS  -pipe -O2 -march=nocona   -Wnon-virtual-dtor -Wno-long-long -ansi -Wundef -Wcast-align -Wchar-subscripts -Wall -W -Wpointer-arith -Wformat-security -fno-exceptions -fno-check-new -fno-common -Woverloaded-virtual -fvisibility=hidden -g3 -fno-inline -fPIC -I/home/harry/kde/build/playground/base/plasma/engines/potd -I/home/harry/kde/src/playground/base/plasma/engines/potd -I/home/harry/kde/src/playground/base/plasma -I/home/harry/kde/build/playground/base/plasma -I/home/harry/kde/include -I/home/harry/kde/include/KDE -I/home/harry/qt-copy/include/QtDBus -I/home/harry/qt-copy/include/QtTest -I/home/harry/qt-copy/include/QtUiTools -I/home/harry/qt-copy/include/QtScript -I/home/harry/qt-copy/include/QtSvg -I/home/harry/qt-copy/include/QtXml -I/home/harry/qt-copy/include/QtSql -I/home/harry/qt-copy/include/QtOpenGL -I/home/harry/qt-copy/include/QtNetwork -I/home/harry/qt-copy/include/QtDesigner -I/home/harry/qt-copy/include/QtAssistant -I/home/harry/qt-copy/include/Qt3Support -I/home/harry/qt-copy/include/QtGui -I/home/harry/qt-copy/include/QtCore -I/home/harry/qt-copy/include/Qt -I/home/harry/qt-copy/mkspecs/default -I/home/harry/qt-copy/include   -D_BSD_SOURCE -D_XOPEN_SOURCE=500 -D_BSD_SOURCE -D_GNU_SOURCE -DQT_NO_STL -DQT_NO_CAST_TO_ASCII -D_REENTRANT -DKDE_DEPRECATED_WARNINGS -o engines/potd/CMakeFiles/plasma_potd_flickrprovider.dir/plasma_potd_flickrprovider_automoc.o -c /home/harry/kde/build/playground/base/plasma/engines/potd/plasma_potd_flickrprovider_automoc.cpp
/home/harry/kde/src/playground/base/plasma/plasmagik/refactoring/uploader.cpp: In member function ‘void KNS::Uploader::initializeSpecialWidgets()’:
/home/harry/kde/src/playground/base/plasma/plasmagik/refactoring/uploader.cpp:157: warning: ‘fullName’ is deprecated (declared at /home/harry/kde/include/KDE/../kuser.h:177)
/home/harry/kde/src/playground/base/plasma/plasmagik/refactoring/uploader.cpp: At global scope:
/home/harry/kde/src/playground/base/plasma/plasmagik/refactoring/uploader.cpp:215: warning: unused parameter‘column’
/home/harry/kde/src/playground/base/plasma/plasmagik/refactoring/uploader.cpp: In member function ‘void KNS::Uploader::doUpload()’:
/home/harry/kde/src/playground/base/plasma/plasmagik/refactoring/uploader.cpp:240: warning: unused variable ‘entry’
/home/harry/kde/src/playground/base/plasma/plasmagik/refactoring/uploader.cpp: In member function ‘bool KNS::Uploader::createPackage()’:
/home/harry/kde/src/playground/base/plasma/plasmagik/refactoring/uploader.cpp:338: error: ‘class Plasma::PackageMetadata’ has no member named ‘setPluginName’
/home/harry/kde/src/playground/base/plasma/plasmagik/refactoring/uploader.cpp:361: error: ‘class Plasma::PackageMetadata’ has no member named ‘pluginName’
/home/harry/kde/src/playground/base/plasma/plasmagik/refactoring/uploader.cpp:394: error: ‘class Plasma::PackageMetadata’ has no member named ‘pluginName’
/home/harry/kde/src/playground/base/plasma/plasmagik/refactoring/uploader.cpp:361: warning: unused variable ‘name_vers’
make[2]: *** [plasmagik/refactoring/CMakeFiles/plasmagik.dir/uploader.o] Error 1
make[2]: Leaving directory `/home/harry/kde/build/playground/base/plasma'
make[1]: *** [plasmagik/refactoring/CMakeFiles/plasmagik.dir/all] Error 2
make[1]: *** Waiting for unfinished jobs....