All pastes #947065 Raw Edit

make check of tor-0.2.0.22-rc

public text v1 · immutable
·published 2008-03-18 03:50 UTC
rendered paste body
keb@peace:~/Documents/src/tor-0.2.0.22-rc$ make check
Making check in src
make[1]: Entering directory `/home/keb/Documents/src/tor-0.2.0.22-rc/src'
Making check in common
make[2]: Entering directory `/home/keb/Documents/src/tor-0.2.0.22-rc/src/common'
make[2]: Nothing to be done for `check'.
make[2]: Leaving directory `/home/keb/Documents/src/tor-0.2.0.22-rc/src/common'
Making check in or
make[2]: Entering directory `/home/keb/Documents/src/tor-0.2.0.22-rc/src/or'
make  check-TESTS
make[3]: Entering directory `/home/keb/Documents/src/tor-0.2.0.22-rc/src/or'
Running Tor unit tests on Linux i686

============================== buffers
............................................................................................................................................................................................................................................................................................................................................................................................................................................
============================== crypto
...................................................................................................................................................................................................................................................................................................................................................................................................................................................................................................
============================== util
......................................................................................................................................................................................................................................................................................................................................................................................................................................................................................................................................................................................
============================== onion_handshake
.....
============================== dir_format
........................Mar 17 23:45:34.704 [err] router_dump_router_to_string(): Bug: We just generated a router descriptor we can't parse.
Mar 17 23:45:34.704 [err] router_dump_router_to_string(): Bug: Descriptor was: <<router Magri 18.244.0.1 9000 0 9003
platform Tor 0.2.0.22-rc on Linux i686
opt protocols Link 1 Circuit 1
published 1970-01-01 00:00:00
opt fingerprint 69AD 0B9A DDDA 8CDE BD71 99D4 E1D3 0639 0EBA F12C
uptime 0
bandwidth 1000 5000 10000
opt extra-info-digest 0000000000000000000000000000000000000000
onion-key
-----BEGIN RSA PUBLIC KEY-----
MIGJAoGBANLt2DITs4k78hcH1MJyJgOupMmsOkcPR04I4cm/4DKCDHvuChti7p+B
OoxXl0z7rEh/Z/+H74Jf4dP8XdJiRZ3Kt8Ry86zTNQvCWNtXq8eesuJ85B5Oq7pT
AlodviJErYPUO9Eu/7N71MjBMcgd52YxsKyv8LiDT3ug3PhZVZMVAgMBAAE=
-----END RSA PUBLIC KEY-----
signing-key
-----BEGIN RSA PUBLIC KEY-----
MIGJAoGBANBElJRaoO1JIzHBuy6KHYJeH2iLhYefETWqJvPltDo1piVwnkeS41jY
PAPHJfUF0uZg8Fr0ivV9VRDDY7rSZlWjMw743BhV1z7gFEIWoAK22FkTy+/JvpVk
77Vc+32MK+YW19GPdhGsIFRXHX3z8G72j+vgkCNfpiHfUW/4DYofAgMBAAE=
-----END RSA PUBLIC KEY-----
router-signature
-----BEGIN SIGNATURE-----
emEl/6NWloDKBF6qlOIlXoRkWkGV4MhDA2xGR5DeyAqf0cXnz5ua1vouqrQQ1yIf
3UNyGKOmkEZkQJOOVBE1OlxzfLNGfSvZKPwi2VwMMwhqnsaoJHEmBEjr6MeTHU2l
aBWyyS+c8l0eSnbkdLEbapykDmoyrOQXZyb6x7YT+So=
-----END SIGNATURE-----

>>

File test.c: line 2280 (test_dir_format): assertion failed: (router_dump_router_to_string(buf, 2048, r1, pk2)>0)

============================== v3_networkstatus
.......................................................................................................................................................
============================== policies
........
File test.c: line 3000 (test_policies): assertion failed: (ADDR_POLICY_REJECTED == compare_addr_to_addr_policy(0x01020304u, 2, NULL))

============================== rend_fns
.........................................
============================== geoip
..................
FAIL: test
===================
1 of 1 tests failed
===================
make[3]: *** [check-TESTS] Error 1
make[3]: Leaving directory `/home/keb/Documents/src/tor-0.2.0.22-rc/src/or'
make[2]: *** [check-am] Error 2
make[2]: Leaving directory `/home/keb/Documents/src/tor-0.2.0.22-rc/src/or'
make[1]: *** [check-recursive] Error 1
make[1]: Leaving directory `/home/keb/Documents/src/tor-0.2.0.22-rc/src'
make: *** [check-recursive] Error 1