rhett@applestone-linux:~/kiwi/builder/resolution/rmds> make
Making all in src
make[1]: Entering directory `/home/rhett/kiwi/builder/resolution/rmds/src'
gcc -DPACKAGE_NAME=\"\" -DPACKAGE_TARNAME=\"\" -DPACKAGE_VERSION=\"\" -DPACKAGE_STRING=\"\" -DPACKAGE_BUGREPORT=\"\" -DPACKAGE=\"rmds\" -DVERSION=\"0.1\" -DSTDC_HEADERS=1 -DHAVE_SYS_TYPES_H=1 -DHAVE_SYS_STAT_H=1 -DHAVE_STDLIB_H=1 -DHAVE_STRING_H=1 -DHAVE_MEMORY_H=1 -DHAVE_STRINGS_H=1 -DHAVE_INTTYPES_H=1 -DHAVE_STDINT_H=1 -DHAVE_UNISTD_H=1 -DHAVE_XMLRPC_C_SERVER_ABYSS_H=1 -I. -g -I/usr/local/include -I/usr/local/include -I/usr/include/glib-2.0 -I/usr/lib/glib-2.0/include -pthread -I/usr/include/glib-2.0 -I/usr/lib/glib-2.0/include -g -O2 -MT rmds-solv_write.o -MD -MP -MF .deps/rmds-solv_write.Tpo -c -o rmds-solv_write.o `test -f 'solv_write.c' || echo './'`solv_write.c
solv_write.c:361: error: expected specifier-qualifier-list before ‘Dirpool’
solv_write.c: In function ‘data_addid’:
solv_write.c:403: warning: assignment makes pointer from integer without a cast
solv_write.c: In function ‘data_addblob’:
solv_write.c:431: warning: assignment makes pointer from integer without a cast
solv_write.c: In function ‘addschema’:
solv_write.c:447: error: ‘struct cbdata’ has no member named ‘schematacache’
solv_write.c:450: error: ‘struct cbdata’ has no member named ‘myschemadata’
solv_write.c:450: error: ‘struct cbdata’ has no member named ‘myschemata’
solv_write.c:453: error: ‘struct cbdata’ has no member named ‘nmyschemata’
solv_write.c:454: error: ‘struct cbdata’ has no member named ‘myschemadata’
solv_write.c:454: error: ‘struct cbdata’ has no member named ‘myschemata’
solv_write.c:458: error: ‘struct cbdata’ has no member named ‘myschemadata’
solv_write.c:458: error: ‘struct cbdata’ has no member named ‘myschemadata’
solv_write.c:458: error: ‘struct cbdata’ has no member named ‘myschemadatalen’
solv_write.c:459: error: ‘struct cbdata’ has no member named ‘myschemata’
solv_write.c:459: error: ‘struct cbdata’ has no member named ‘myschemata’
solv_write.c:459: error: ‘struct cbdata’ has no member named ‘nmyschemata’
solv_write.c:460: error: ‘struct cbdata’ has no member named ‘nmyschemata’
solv_write.c:462: error: ‘struct cbdata’ has no member named ‘myschemata’
solv_write.c:463: error: ‘struct cbdata’ has no member named ‘myschemadata’
solv_write.c:464: error: ‘struct cbdata’ has no member named ‘nmyschemata’
solv_write.c:465: error: ‘struct cbdata’ has no member named ‘myschemadatalen’
solv_write.c:468: error: ‘struct cbdata’ has no member named ‘myschemadata’
solv_write.c:468: error: ‘struct cbdata’ has no member named ‘myschemadatalen’
solv_write.c:469: error: ‘struct cbdata’ has no member named ‘myschemata’
solv_write.c:469: error: ‘struct cbdata’ has no member named ‘nmyschemata’
solv_write.c:469: error: ‘struct cbdata’ has no member named ‘myschemadatalen’
solv_write.c:470: error: ‘struct cbdata’ has no member named ‘myschemadatalen’
solv_write.c:471: error: ‘struct cbdata’ has no member named ‘schematacache’
solv_write.c:471: error: ‘struct cbdata’ has no member named ‘nmyschemata’
solv_write.c:472: error: ‘struct cbdata’ has no member named ‘nmyschemata’
solv_write.c: In function ‘putinownpool’:
solv_write.c:480: error: ‘struct cbdata’ has no member named ‘needid’
solv_write.c:482: error: ‘struct cbdata’ has no member named ‘needid’
solv_write.c:486: error: ‘struct cbdata’ has no member named ‘needid’
solv_write.c:486: error: ‘struct cbdata’ has no member named ‘needid’
solv_write.c:488: error: ‘struct cbdata’ has no member named ‘needid’
solv_write.c:488: error: ‘struct cbdata’ has no member named ‘needid’
solv_write.c:489: error: ‘struct cbdata’ has no member named ‘needid’
solv_write.c:490: error: ‘struct cbdata’ has no member named ‘needid’
solv_write.c: At top level:
solv_write.c:496: error: expected declaration specifiers or ‘...’ before ‘Dirpool’
solv_write.c: In function ‘putinowndirpool’:
solv_write.c:500: error: ‘dp’ undeclared (first use in this function)
solv_write.c:500: error: (Each undeclared identifier is reported only once
solv_write.c:500: error: for each function it appears in.)
solv_write.c:502: error: too many arguments to function ‘putinowndirpool’
solv_write.c:505: error: ‘Repodata’ has no member named ‘localpool’
solv_write.c:505: error: ‘Repodata’ has no member named ‘spool’
solv_write.c:506: error: ‘struct cbdata’ has no member named ‘owndirpool’
solv_write.c: At top level:
solv_write.c:510: error: expected declaration specifiers or ‘...’ before ‘Dirpool’
solv_write.c: In function ‘setdirused’:
solv_write.c:512: error: ‘struct cbdata’ has no member named ‘dirused’
solv_write.c:514: error: ‘struct cbdata’ has no member named ‘dirused’
solv_write.c:515: error: ‘dp’ undeclared (first use in this function)
solv_write.c:517: error: ‘struct cbdata’ has no member named ‘dirused’
solv_write.c:519: error: ‘struct cbdata’ has no member named ‘dirused’
solv_write.c:521: error: ‘struct cbdata’ has no member named ‘dirused’
solv_write.c:524: error: ‘struct cbdata’ has no member named ‘dirused’
solv_write.c:526: error: ‘struct cbdata’ has no member named ‘dirused’
solv_write.c: At top level:
solv_write.c:530: error: expected declaration specifiers or ‘...’ before ‘KeyValue’
solv_write.c: In function ‘repo_write_cb_needed’:
solv_write.c:540: error: ‘struct cbdata’ has no member named ‘keymap’
solv_write.c:540: error: ‘struct cbdata’ has no member named ‘keymapstart’
solv_write.c:542: error: ‘SEARCH_NEXT_KEY’ undeclared (first use in this function)
solv_write.c:543: error: ‘struct cbdata’ has no member named ‘sp’
solv_write.c:543: error: ‘struct cbdata’ has no member named ‘schema’
solv_write.c:543: error: ‘struct cbdata’ has no member named ‘sp’
solv_write.c:544: error: ‘struct cbdata’ has no member named ‘sp’
solv_write.c:549: error: ‘kv’ undeclared (first use in this function)
solv_write.c:551: error: ‘Repodata’ has no member named ‘localpool’
solv_write.c:551: error: ‘Repodata’ has no member named ‘spool’
solv_write.c:552: error: ‘struct cbdata’ has no member named ‘needid’
solv_write.c:554: error: ‘TYPE_DIR’ undeclared (first use in this function)
solv_write.c:555: error: ‘TYPE_DIRNUMNUMARRAY’ undeclared (first use in this function)
solv_write.c:557: error: ‘struct cbdata’ has no member named ‘owndirpool’
solv_write.c:558: error: ‘Repodata’ has no member named ‘dirpool’
solv_write.c:558: error: too many arguments to function ‘putinowndirpool’
solv_write.c:560: error: ‘Repodata’ has no member named ‘dirpool’
solv_write.c:560: error: too many arguments to function ‘setdirused’
solv_write.c: At top level:
solv_write.c:569: error: expected declaration specifiers or ‘...’ before ‘KeyValue’
solv_write.c: In function ‘repo_write_cb_sizes’:
solv_write.c:578: error: ‘struct cbdata’ has no member named ‘keymap’
solv_write.c:578: error: ‘struct cbdata’ has no member named ‘keymapstart’
solv_write.c:582: error: ‘struct cbdata’ has no member named ‘mykeys’
solv_write.c:584: error: ‘struct cbdata’ has no member named ‘extdata’
solv_write.c:585: error: ‘struct cbdata’ has no member named ‘vstart’
solv_write.c:586: error: ‘struct cbdata’ has no member named ‘vstart’
solv_write.c:589: error: ‘struct cbdata’ has no member named ‘extdata’
solv_write.c:593: error: ‘TYPE_CONSTANT’ undeclared (first use in this function)
solv_write.c:596: error: ‘kv’ undeclared (first use in this function)
solv_write.c:598: error: ‘Repodata’ has no member named ‘localpool’
solv_write.c:598: error: ‘Repodata’ has no member named ‘spool’
solv_write.c:599: error: ‘struct cbdata’ has no member named ‘needid’
solv_write.c:605: error: ‘Repodata’ has no member named ‘localpool’
solv_write.c:605: error: ‘Repodata’ has no member named ‘spool’
solv_write.c:606: error: ‘struct cbdata’ has no member named ‘needid’
solv_write.c:620: error: ‘TYPE_DIR’ undeclared (first use in this function)
solv_write.c:622: error: ‘struct cbdata’ has no member named ‘dirused’
solv_write.c:625: error: ‘TYPE_NUM’ undeclared (first use in this function)
solv_write.c:628: error: ‘TYPE_DIRNUMNUMARRAY’ undeclared (first use in this function)
solv_write.c:630: error: ‘struct cbdata’ has no member named ‘dirused’
solv_write.c:635: error: ‘TYPE_DIRSTRARRAY’ undeclared (first use in this function)
solv_write.c:637: error: ‘struct cbdata’ has no member named ‘dirused’
solv_write.c:645: error: ‘struct cbdata’ has no member named ‘mykeys’
solv_write.c:648: error: ‘struct cbdata’ has no member named ‘extdata’
solv_write.c:648: error: ‘struct cbdata’ has no member named ‘vstart’
solv_write.c:649: error: ‘struct cbdata’ has no member named ‘extdata’
solv_write.c:649: error: ‘struct cbdata’ has no member named ‘vstart’
solv_write.c:650: error: ‘struct cbdata’ has no member named ‘vstart’
solv_write.c: At top level:
solv_write.c:656: error: expected ‘)’ before ‘*’ token
solv_write.c: In function ‘repo_write’:
solv_write.c:745: error: ‘Dirpool’ undeclared (first use in this function)
solv_write.c:745: error: expected ‘;’ before ‘owndirpool’
solv_write.c:760: error: ‘struct cbdata’ has no member named ‘mykeys’
solv_write.c:761: error: ‘struct cbdata’ has no member named ‘keymap’
solv_write.c:762: error: ‘struct cbdata’ has no member named ‘keymapstart’
solv_write.c:765: error: ‘struct cbdata’ has no member named ‘nmykeys’
solv_write.c:770: error: ‘struct cbdata’ has no member named ‘mykeys’
solv_write.c:790: error: ‘struct cbdata’ has no member named ‘keymap’
solv_write.c:792: error: ‘struct cbdata’ has no member named ‘nmykeys’
solv_write.c:797: error: ‘dirpool’ undeclared (first use in this function)
solv_write.c:802: error: ‘struct cbdata’ has no member named ‘keymapstart’
solv_write.c:803: error: ‘struct cbdata’ has no member named ‘keymap’
solv_write.c:810: error: ‘struct cbdata’ has no member named ‘nmykeys’
solv_write.c:812: error: ‘struct cbdata’ has no member named ‘mykeys’
solv_write.c:812: error: ‘struct cbdata’ has no member named ‘mykeys’
solv_write.c:814: error: ‘TYPE_CONSTANT’ undeclared (first use in this function)
solv_write.c:814: error: ‘struct cbdata’ has no member named ‘mykeys’
solv_write.c:819: error: ‘struct cbdata’ has no member named ‘nmykeys’
solv_write.c:821: error: ‘struct cbdata’ has no member named ‘keymap’
solv_write.c:824: error: ‘struct cbdata’ has no member named ‘mykeys’
solv_write.c:824: error: ‘struct cbdata’ has no member named ‘nmykeys’
solv_write.c:825: error: ‘struct cbdata’ has no member named ‘mykeys’
solv_write.c:825: error: ‘struct cbdata’ has no member named ‘nmykeys’
solv_write.c:834: error: ‘struct cbdata’ has no member named ‘keymap’
solv_write.c:839: error: ‘Repodata’ has no member named ‘state’
solv_write.c:839: error: ‘REPODATA_STUB’ undeclared (first use in this function)
solv_write.c:841: error: ‘Repodata’ has no member named ‘loadcallback’
solv_write.c:842: error: ‘Repodata’ has no member named ‘loadcallback’
solv_write.c:844: error: ‘Repodata’ has no member named ‘state’
solv_write.c:844: error: ‘REPODATA_ERROR’ undeclared (first use in this function)
solv_write.c:845: error: ‘Repodata’ has no member named ‘state’
solv_write.c:849: error: ‘struct cbdata’ has no member named ‘keymapstart’
solv_write.c:853: error: ‘Repodata’ has no member named ‘state’
solv_write.c:856: error: ‘struct cbdata’ has no member named ‘keymap’
solv_write.c:859: error: ‘struct cbdata’ has no member named ‘keymap’
solv_write.c:859: error: ‘struct cbdata’ has no member named ‘nmykeys’
solv_write.c:863: error: ‘TYPE_DIR’ undeclared (first use in this function)
solv_write.c:863: error: ‘TYPE_DIRNUMNUMARRAY’ undeclared (first use in this function)
solv_write.c:868: error: ‘Repodata’ has no member named ‘localpool’
solv_write.c:875: error: ‘Repodata’ has no member named ‘spool’
solv_write.c:893: error: ‘Repodata’ has no member named ‘dirpool’
solv_write.c:897: error: ‘struct cbdata’ has no member named ‘nkeymap’
solv_write.c:923: error: ‘owndirpool’ undeclared (first use in this function)
solv_write.c:925: error: ‘struct cbdata’ has no member named ‘owndirpool’
solv_write.c:928: error: ‘struct cbdata’ has no member named ‘dirused’
solv_write.c:954: error: ‘struct cbdata’ has no member named ‘needid’
solv_write.c:955: error: ‘struct cbdata’ has no member named ‘schema’
solv_write.c:955: error: ‘struct cbdata’ has no member named ‘nmykeys’
solv_write.c:956: error: ‘struct cbdata’ has no member named ‘sp’
solv_write.c:956: error: ‘struct cbdata’ has no member named ‘schema’
solv_write.c:957: error: ‘struct cbdata’ has no member named ‘solvschemata’
solv_write.c:967: error: ‘struct cbdata’ has no member named ‘schema’
solv_write.c:968: error: ‘struct cbdata’ has no member named ‘keymap’
solv_write.c:973: error: ‘struct cbdata’ has no member named ‘keymap’
solv_write.c:978: error: ‘struct cbdata’ has no member named ‘keymap’
solv_write.c:983: error: ‘struct cbdata’ has no member named ‘keymap’
solv_write.c:988: error: ‘struct cbdata’ has no member named ‘keymap’
solv_write.c:991: error: ‘struct cbdata’ has no member named ‘mykeys’
solv_write.c:993: error: ‘struct cbdata’ has no member named ‘keymap’
solv_write.c:996: error: ‘struct cbdata’ has no member named ‘mykeys’
solv_write.c:998: error: ‘struct cbdata’ has no member named ‘keymap’
solv_write.c:1001: error: ‘struct cbdata’ has no member named ‘mykeys’
solv_write.c:1003: error: ‘struct cbdata’ has no member named ‘keymap’
solv_write.c:1006: error: ‘struct cbdata’ has no member named ‘mykeys’
solv_write.c:1008: error: ‘struct cbdata’ has no member named ‘keymap’
solv_write.c:1011: error: ‘struct cbdata’ has no member named ‘mykeys’
solv_write.c:1013: error: ‘struct cbdata’ has no member named ‘keymap’
solv_write.c:1016: error: ‘struct cbdata’ has no member named ‘mykeys’
solv_write.c:1018: error: ‘struct cbdata’ has no member named ‘keymap’
solv_write.c:1021: error: ‘struct cbdata’ has no member named ‘mykeys’
solv_write.c:1023: error: ‘struct cbdata’ has no member named ‘keymap’
solv_write.c:1026: error: ‘struct cbdata’ has no member named ‘mykeys’
solv_write.c:1028: error: ‘struct cbdata’ has no member named ‘keymap’
solv_write.c:1031: error: ‘struct cbdata’ has no member named ‘mykeys’
solv_write.c:1033: error: ‘struct cbdata’ has no member named ‘keymap’
solv_write.c:1036: error: ‘struct cbdata’ has no member named ‘mykeys’
solv_write.c:1038: error: ‘struct cbdata’ has no member named ‘sp’
solv_write.c:1047: error: ‘struct cbdata’ has no member named ‘needid’
solv_write.c:1049: error: ‘struct cbdata’ has no member named ‘sp’
solv_write.c:1050: error: ‘struct cbdata’ has no member named ‘solvschemata’
solv_write.c:1050: error: ‘struct cbdata’ has no member named ‘schema’
solv_write.c:1060: error: ‘struct cbdata’ has no member named ‘nmykeys’
solv_write.c:1061: error: ‘struct cbdata’ has no member named ‘myschemadatalen’
solv_write.c:1062: error: ‘struct cbdata’ has no member named ‘myschemadata’
solv_write.c:1064: error: ‘struct cbdata’ has no member named ‘nmykeys’
solv_write.c:1070: error: ‘struct cbdata’ has no member named ‘mykeys’
solv_write.c:1070: error: ‘struct cbdata’ has no member named ‘mykeys’
solv_write.c:1071: error: ‘struct cbdata’ has no member named ‘mykeys’
solv_write.c:1074: error: ‘struct cbdata’ has no member named ‘nmykeys’
solv_write.c:1075: error: ‘struct cbdata’ has no member named ‘myschemadatalen’
solv_write.c:1076: error: ‘struct cbdata’ has no member named ‘myschemadata’
solv_write.c:1076: error: ‘struct cbdata’ has no member named ‘myschemadata’
solv_write.c:1077: error: ‘struct cbdata’ has no member named ‘nkeymap’
solv_write.c:1078: error: ‘struct cbdata’ has no member named ‘keymap’
solv_write.c:1078: error: ‘struct cbdata’ has no member named ‘keymap’
solv_write.c:1084: error: ‘struct cbdata’ has no member named ‘dirused’
solv_write.c:1084: error: ‘struct cbdata’ has no member named ‘dirused’
solv_write.c:1088: error: ‘struct cbdata’ has no member named ‘dirused’
solv_write.c:1102: error: ‘struct cbdata’ has no member named ‘dirused’
solv_write.c:1102: error: ‘struct cbdata’ has no member named ‘dirused’
solv_write.c:1162: error: ‘struct cbdata’ has no member named ‘dirused’
solv_write.c:1162: error: ‘struct cbdata’ has no member named ‘dirused’
solv_write.c:1163: error: ‘struct cbdata’ has no member named ‘dirused’
solv_write.c:1167: error: ‘struct cbdata’ has no member named ‘dirused’
solv_write.c:1168: error: ‘struct cbdata’ has no member named ‘dirused’
solv_write.c:1169: error: ‘struct cbdata’ has no member named ‘dirused’
solv_write.c:1170: error: ‘struct cbdata’ has no member named ‘dirused’
solv_write.c:1175: error: ‘struct cbdata’ has no member named ‘dirused’
solv_write.c:1181: error: ‘struct cbdata’ has no member named ‘extdata’
solv_write.c:1181: error: ‘struct cbdata’ has no member named ‘nmykeys’
solv_write.c:1182: error: ‘struct cbdata’ has no member named ‘incorelen’
solv_write.c:1186: error: ‘struct cbdata’ has no member named ‘nmykeys’
solv_write.c:1187: error: ‘struct cbdata’ has no member named ‘mykeys’
solv_write.c:1189: error: ‘struct cbdata’ has no member named ‘nmykeys’
solv_write.c:1204: error: ‘struct cbdata’ has no member named ‘incorelen’
solv_write.c:1204: error: ‘struct cbdata’ has no member named ‘extdata’
solv_write.c:1205: error: ‘struct cbdata’ has no member named ‘extdata’
solv_write.c:1216: error: ‘SOLV_VERSION_6’ undeclared (first use in this function)
solv_write.c:1223: error: ‘struct cbdata’ has no member named ‘nmykeys’
solv_write.c:1224: error: ‘struct cbdata’ has no member named ‘nmyschemata’
solv_write.c:1297: error: ‘struct cbdata’ has no member named ‘nmykeys’
solv_write.c:1299: error: ‘struct cbdata’ has no member named ‘mykeys’
solv_write.c:1300: error: ‘struct cbdata’ has no member named ‘mykeys’
solv_write.c:1301: error: ‘struct cbdata’ has no member named ‘mykeys’
solv_write.c:1302: error: ‘struct cbdata’ has no member named ‘mykeys’
solv_write.c:1304: error: ‘struct cbdata’ has no member named ‘extdata’
solv_write.c:1305: error: ‘struct cbdata’ has no member named ‘mykeys’
solv_write.c:1311: error: ‘struct cbdata’ has no member named ‘myschemadatalen’
solv_write.c:1312: error: ‘struct cbdata’ has no member named ‘nmyschemata’
solv_write.c:1314: error: ‘struct cbdata’ has no member named ‘nmyschemata’
solv_write.c:1315: error: ‘struct cbdata’ has no member named ‘myschemadata’
solv_write.c:1315: error: ‘struct cbdata’ has no member named ‘myschemata’
solv_write.c:1348: error: ‘struct cbdata’ has no member named ‘extdata’
solv_write.c:1354: error: ‘struct cbdata’ has no member named ‘solvschemata’
solv_write.c:1365: error: ‘struct cbdata’ has no member named ‘keymap’
solv_write.c:1367: error: ‘struct cbdata’ has no member named ‘keymap’
solv_write.c:1369: error: ‘struct cbdata’ has no member named ‘keymap’
solv_write.c:1371: error: ‘struct cbdata’ has no member named ‘keymap’
solv_write.c:1373: error: ‘struct cbdata’ has no member named ‘keymap’
solv_write.c:1375: error: ‘struct cbdata’ has no member named ‘keymap’
solv_write.c:1377: error: ‘struct cbdata’ has no member named ‘keymap’
solv_write.c:1379: error: ‘struct cbdata’ has no member named ‘keymap’
solv_write.c:1381: error: ‘struct cbdata’ has no member named ‘keymap’
solv_write.c:1383: error: ‘struct cbdata’ has no member named ‘keymap’
solv_write.c:1385: error: ‘struct cbdata’ has no member named ‘keymap’
solv_write.c:1387: error: ‘struct cbdata’ has no member named ‘keymap’
solv_write.c:1389: error: ‘struct cbdata’ has no member named ‘keymap’
solv_write.c:1391: error: ‘struct cbdata’ has no member named ‘keymap’
solv_write.c:1393: error: ‘struct cbdata’ has no member named ‘incorelen’
solv_write.c:1395: error: ‘struct cbdata’ has no member named ‘incorelen’
solv_write.c:1396: error: ‘struct cbdata’ has no member named ‘incorelen’
solv_write.c:1400: error: ‘struct cbdata’ has no member named ‘extdata’
solv_write.c:1403: error: ‘struct cbdata’ has no member named ‘nmykeys’
solv_write.c:1404: error: ‘struct cbdata’ has no member named ‘extdata’
solv_write.c:1406: error: ‘struct cbdata’ has no member named ‘nmykeys’
solv_write.c:1412: error: ‘struct cbdata’ has no member named ‘nmykeys’
solv_write.c:1414: error: ‘struct cbdata’ has no member named ‘extdata’
solv_write.c:1416: error: ‘struct cbdata’ has no member named ‘extdata’
solv_write.c:1417: error: ‘struct cbdata’ has no member named ‘extdata’
solv_write.c:1446: error: ‘struct cbdata’ has no member named ‘nmykeys’
solv_write.c:1447: error: ‘struct cbdata’ has no member named ‘extdata’
solv_write.c:1450: error: ‘struct cbdata’ has no member named ‘solvschemata’
solv_write.c:1451: error: ‘struct cbdata’ has no member named ‘myschemadata’
solv_write.c:1452: error: ‘struct cbdata’ has no member named ‘myschemata’
make[1]: *** [rmds-solv_write.o] Error 1
make[1]: Leaving directory `/home/rhett/kiwi/builder/resolution/rmds/src'
make: *** [all-recursive] Error 1