nsDataSignatureVerifier.cpp
../../../../dist/include/pipnss/nsIX509Cert2.h:22: warning: ‘CERTCertificate’: visibility attribute ignored because it
../../../../dist/include/nss/certt.h:72: warning: conflicts with previous declaration here
/Users/jjgod/Codes/c/mozilla/security/manager/ssl/src/nsIdentityChecking.cpp: In member function ‘nsresult nsNSSCertificate::hasValidEVOidTag(SECOidTag&, PRBool&)’:
/Users/jjgod/Codes/c/mozilla/security/manager/ssl/src/nsIdentityChecking.cpp:756: error: ‘CERTRevocationMethodIndex’ was not declared in this scope
/Users/jjgod/Codes/c/mozilla/security/manager/ssl/src/nsIdentityChecking.cpp:756: error: expected `;' before ‘preferedRevMethods’
/Users/jjgod/Codes/c/mozilla/security/manager/ssl/src/nsIdentityChecking.cpp:761: error: ‘CERT_REV_M_TEST_USING_THIS_METHOD’ was not declared in this scope
/Users/jjgod/Codes/c/mozilla/security/manager/ssl/src/nsIdentityChecking.cpp:762: error: ‘CERT_REV_M_ALLOW_NETWORK_FETCHING’ was not declared in this scope
/Users/jjgod/Codes/c/mozilla/security/manager/ssl/src/nsIdentityChecking.cpp:763: error: ‘CERT_REV_M_ALLOW_IMPLICIT_DEFAULT_SOURCE’ was not declared in this scope
/Users/jjgod/Codes/c/mozilla/security/manager/ssl/src/nsIdentityChecking.cpp:764: error: ‘CERT_REV_M_REQUIRE_INFO_ON_MISSING_SOURCE’ was not declared in this scope
/Users/jjgod/Codes/c/mozilla/security/manager/ssl/src/nsIdentityChecking.cpp:765: error: ‘CERT_REV_M_FAIL_ON_MISSING_FRESH_INFO’ was not declared in this scope
/Users/jjgod/Codes/c/mozilla/security/manager/ssl/src/nsIdentityChecking.cpp:766: error: ‘CERT_REV_M_STOP_TESTING_ON_FRESH_INFO’ was not declared in this scope
/Users/jjgod/Codes/c/mozilla/security/manager/ssl/src/nsIdentityChecking.cpp:769: error: ‘CERT_REV_MI_TEST_ALL_LOCAL_INFORMATION_FIRST’ was not declared in this scope
/Users/jjgod/Codes/c/mozilla/security/manager/ssl/src/nsIdentityChecking.cpp:770: error: ‘CERT_REV_MI_REQUIRE_SOME_FRESH_INFO_AVAILABLE’ was not declared in this scope
/Users/jjgod/Codes/c/mozilla/security/manager/ssl/src/nsIdentityChecking.cpp:773: error: ‘cert_revocation_method_crl’ was not declared in this scope
/Users/jjgod/Codes/c/mozilla/security/manager/ssl/src/nsIdentityChecking.cpp:774: error: ‘cert_revocation_method_ocsp’ was not declared in this scope
/Users/jjgod/Codes/c/mozilla/security/manager/ssl/src/nsIdentityChecking.cpp:776: error: ‘CERTRevocationFlags’ was not declared in this scope
/Users/jjgod/Codes/c/mozilla/security/manager/ssl/src/nsIdentityChecking.cpp:776: error: expected `;' before ‘rev’
/Users/jjgod/Codes/c/mozilla/security/manager/ssl/src/nsIdentityChecking.cpp:778: error: ‘rev’ was not declared in this scope
/Users/jjgod/Codes/c/mozilla/security/manager/ssl/src/nsIdentityChecking.cpp:781: error: ‘preferedRevMethods’ was not declared in this scope
/Users/jjgod/Codes/c/mozilla/security/manager/ssl/src/nsIdentityChecking.cpp:798: error: ‘union CERTValParamInValueStr::<anonymous>’ has no member named ‘revocation’
/Users/jjgod/Codes/c/mozilla/security/manager/ssl/src/nsIdentityChecking.cpp:800: error: ‘cert_pi_trustAnchors’ was not declared in this scope
make[6]: *** [nsIdentityChecking.o] Error 1