All pastes #944465 Raw Edit

Something

public text v1 · immutable
·published 2008-03-16 03:07 UTC
rendered paste body
python.c:932: error: 'PyObject' undeclared (first use in this function)
python.c:932: error: 'obj' undeclared (first use in this function)
python.c:932: error: 'obj1' undeclared (first use in this function)
python.c:932: error: 'obj2' undeclared (first use in this function)
python.c:932: error: 'py_mod' undeclared (first use in this function)
python.c:932: error: 'mdict' undeclared (first use in this function)
python.c:952: error: 'pymelem_type' undeclared (first use in this function)
python.c:954: error: 'pymixer_type' undeclared (first use in this function)
python.c:956: error: 'python_methods' undeclared (first use in this function)
python.c:958: error: 'main_interpreter' undeclared (first use in this function)
python.c:958: error: invalid type argument of '->'
python.c:962: error: 'struct python_priv' has no member named 'py_mdict'
python.c:972: error: expected expression before ')' token
python.c:973: error: expected expression before ')' token
python.c:984: error: 'struct python_priv' has no member named 'py_mixer'
python.c:991: error: 'Py_file_input' undeclared (first use in this function)
python.c:995: error: 'struct python_priv' has no member named 'py_event_func'
python.c:996: error: 'struct python_priv' has no member named 'py_event_func'
make[3]: *** [smixer_python_la-python.lo] Error 1
make[3]: Leaving directory `/var/tmp/portage/media-libs/alsa-lib-1.0.16/work/alsa-lib-1.0.16/modules/mixer/simple'
make[2]: *** [all-recursive] Error 1
make[2]: Leaving directory `/var/tmp/portage/media-libs/alsa-lib-1.0.16/work/alsa-lib-1.0.16/modules/mixer'
make[1]: *** [all-recursive] Error 1
make[1]: Leaving directory `/var/tmp/portage/media-libs/alsa-lib-1.0.16/work/alsa-lib-1.0.16/modules'
make: *** [all-recursive] Error 1
 * 
 * ERROR: media-libs/alsa-lib-1.0.16 failed.
 * Call stack:
 *               ebuild.sh, line   49:  Called src_compile
 *             environment, line 2505:  Called die
 * The specific snippet of code:
 *       emake || die "make failed";
 *  The die message:
 *   make failed
 * 
 * If you need support, post the topmost build error, and the call stack if relevant.
 * A complete build log is located at '/var/tmp/portage/media-libs/alsa-lib-1.0.16/temp/build.log'.
 * The ebuild environment file is located at '/var/tmp/portage/media-libs/alsa-lib-1.0.16/temp/environment'.
 * 

 * Messages for package media-libs/alsa-lib-1.0.16:

 * 
 * ERROR: media-libs/alsa-lib-1.0.16 failed.
 * Call stack:
 *               ebuild.sh, line   49:  Called src_compile
 *             environment, line 2505:  Called die
 * The specific snippet of code:
 *       emake || die "make failed";
 *  The die message:
 *   make failed
 * 
 * If you need support, post the topmost build error, and the call stack if relevant.
 * A complete build log is located at '/var/tmp/portage/media-libs/alsa-lib-1.0.16/temp/build.log'.
 * The ebuild environment file is located at '/var/tmp/portage/media-libs/alsa-lib-1.0.16/temp/environment'.