minami:osx markluffel$ scons
scons: Reading SConscript files ...
scons: done reading SConscript files.
scons: Building targets ...
gcc -o src/quartz_cairo_bridge.os -c -Wall -Werror -DXTHREADS -I/opt/local/include/cairo -I/opt/local/include/freetype2 -I/opt/local/include -I/opt/local/include/libpng12 -I/usr/X11/include -fPIC -I/System/Library/Frameworks/Python.framework/Versions/2.5/include/python2.5 -Isrc/pycairo src/quartz_cairo_bridge.m
src/quartz_cairo_bridge.m:2:26: error: cairo-quartz.h: No such file or directory
src/quartz_cairo_bridge.m: In function 'cairo_surface_from_NSGraphicsContext':
src/quartz_cairo_bridge.m:27: error: 'CGContextRef' undeclared (first use in this function)
src/quartz_cairo_bridge.m:27: error: (Each undeclared identifier is reported only once
src/quartz_cairo_bridge.m:27: error: for each function it appears in.)
src/quartz_cairo_bridge.m:27: error: syntax error before 'cgContext'
cc1obj: warnings being treated as errors
src/quartz_cairo_bridge.m:29: warning: implicit declaration of function 'cairo_quartz_surface_create_for_cg_context'
src/quartz_cairo_bridge.m:30: error: 'cgContext' undeclared (first use in this function)
src/quartz_cairo_bridge.m:33: warning: initialization makes pointer from integer without a cast
src/quartz_cairo_bridge.m:26: warning: unused variable 'nsContext'
scons: *** [src/quartz_cairo_bridge.os] Error 1
scons: building terminated because of errors.
minami:osx markluffel$