make -C /lib/modules/2.6.24.3-bitobor/source O=/lib/modules/2.6.24.3-bitobor/build M=/root/iwlwifi-1.2.25/compatible/ EXTRA_CFLAGS="-DCONFIG_IWL3945_DEBUG=y -DCONFIG_IWL4965_DEBUG=y -DCONFIG_IWL3945_SPECTRUM_MEASUREMENT=y -DCONFIG_IWL4965_SPECTRUM_MEASUREMENT=y -DCONFIG_IWL4965_SENSITIVITY=y -DCONFIG_IWL3945_QOS=y -DCONFIG_IWL4965_QOS=y" modules
make[1]: Entering directory `/usr/src/linux-2.6.24.3'
CC [M] /root/iwlwifi-1.2.25/compatible/iwl3945-base.o
In file included from /root/iwlwifi-1.2.25/compatible/iwl3945-base.c:51:
/root/iwlwifi-1.2.25/compatible/iwl-3945.h:443: error: expected specifier-qualifier-list before 'ieee80211_key_alg'
/root/iwlwifi-1.2.25/compatible/iwl3945-base.c: In function 'iwl3945_add_station':
/root/iwlwifi-1.2.25/compatible/iwl3945-base.c:539: error: implicit declaration of function 'MAC_ARG'
/root/iwlwifi-1.2.25/compatible/iwl3945-base.c:539: warning: too few arguments for format
/root/iwlwifi-1.2.25/compatible/iwl3945-base.c: In function 'iwl3945_commit_rxon':
/root/iwlwifi-1.2.25/compatible/iwl3945-base.c:1161: warning: too few arguments for format
/root/iwlwifi-1.2.25/compatible/iwl3945-base.c: In function 'iwl3945_update_sta_key_info':
/root/iwlwifi-1.2.25/compatible/iwl3945-base.c:1400: error: 'struct iwl3945_hw_key' has no member named 'alg'
/root/iwlwifi-1.2.25/compatible/iwl3945-base.c:1401: error: 'struct iwl3945_hw_key' has no member named 'keylen'
/root/iwlwifi-1.2.25/compatible/iwl3945-base.c:1402: error: 'struct iwl3945_hw_key' has no member named 'key'
/root/iwlwifi-1.2.25/compatible/iwl3945-base.c:1402: error: 'struct iwl3945_hw_key' has no member named 'key'
/root/iwlwifi-1.2.25/compatible/iwl3945-base.c: In function 'iwl3945_build_tx_cmd_hwcrypto':
/root/iwlwifi-1.2.25/compatible/iwl3945-base.c:2594: error: 'struct iwl3945_hw_key' has no member named 'alg'
/root/iwlwifi-1.2.25/compatible/iwl3945-base.c:2597: error: 'struct iwl3945_hw_key' has no member named 'keylen'
/root/iwlwifi-1.2.25/compatible/iwl3945-base.c:2597: error: 'struct iwl3945_hw_key' has no member named 'key'
/root/iwlwifi-1.2.25/compatible/iwl3945-base.c:2597: error: 'struct iwl3945_hw_key' has no member named 'keylen'
/root/iwlwifi-1.2.25/compatible/iwl3945-base.c:2597: error: 'struct iwl3945_hw_key' has no member named 'key'
/root/iwlwifi-1.2.25/compatible/iwl3945-base.c:2597: error: 'struct iwl3945_hw_key' has no member named 'keylen'
/root/iwlwifi-1.2.25/compatible/iwl3945-base.c:2617: error: 'struct iwl3945_hw_key' has no member named 'keylen'
/root/iwlwifi-1.2.25/compatible/iwl3945-base.c:2620: error: 'struct iwl3945_hw_key' has no member named 'keylen'
/root/iwlwifi-1.2.25/compatible/iwl3945-base.c:2620: error: 'struct iwl3945_hw_key' has no member named 'key'
/root/iwlwifi-1.2.25/compatible/iwl3945-base.c:2620: error: 'struct iwl3945_hw_key' has no member named 'keylen'
/root/iwlwifi-1.2.25/compatible/iwl3945-base.c:2620: error: 'struct iwl3945_hw_key' has no member named 'key'
/root/iwlwifi-1.2.25/compatible/iwl3945-base.c:2620: error: 'struct iwl3945_hw_key' has no member named 'keylen'
/root/iwlwifi-1.2.25/compatible/iwl3945-base.c:2626: error: 'ALG_NONE' undeclared (first use in this function)
/root/iwlwifi-1.2.25/compatible/iwl3945-base.c:2626: error: (Each undeclared identifier is reported only once
/root/iwlwifi-1.2.25/compatible/iwl3945-base.c:2626: error: for each function it appears in.)
/root/iwlwifi-1.2.25/compatible/iwl3945-base.c:2631: error: 'struct iwl3945_hw_key' has no member named 'alg'
/root/iwlwifi-1.2.25/compatible/iwl3945-base.c: In function 'iwl3945_get_sta_id':
/root/iwlwifi-1.2.25/compatible/iwl3945-base.c:2739: warning: too few arguments for format
/root/iwlwifi-1.2.25/compatible/iwl3945-base.c: In function 'iwl3945_tx_skb':
/root/iwlwifi-1.2.25/compatible/iwl3945-base.c:2820: warning: too few arguments for format
/root/iwlwifi-1.2.25/compatible/iwl3945-base.c:2903: warning: comparison is always true due to limited range of data type
/root/iwlwifi-1.2.25/compatible/iwl3945-base.c: In function 'iwl3945_print_rx_config_cmd':
/root/iwlwifi-1.2.25/compatible/iwl3945-base.c:4514: warning: too few arguments for format
/root/iwlwifi-1.2.25/compatible/iwl3945-base.c:4516: warning: too few arguments for format
/root/iwlwifi-1.2.25/compatible/iwl3945-base.c: In function 'iwl3945_bg_post_associate':
/root/iwlwifi-1.2.25/compatible/iwl3945-base.c:6804: warning: too few arguments for format
/root/iwlwifi-1.2.25/compatible/iwl3945-base.c: In function 'iwl3945_mac_add_interface':
/root/iwlwifi-1.2.25/compatible/iwl3945-base.c:7096: warning: too few arguments for format
/root/iwlwifi-1.2.25/compatible/iwl3945-base.c: In function 'iwl3945_mac_config_interface':
/root/iwlwifi-1.2.25/compatible/iwl3945-base.c:7282: warning: too few arguments for format
/root/iwlwifi-1.2.25/compatible/iwl3945-base.c:7286: error: 'IEEE80211_HW_NO_PROBE_FILTERING' undeclared (first use in this function)
/root/iwlwifi-1.2.25/compatible/iwl3945-base.c:7302: warning: too few arguments for format
/root/iwlwifi-1.2.25/compatible/iwl3945-base.c: At top level:
/root/iwlwifi-1.2.25/compatible/iwl3945-base.c:7447: error: expected declaration specifiers or '...' before 'set_key_cmd'
/root/iwlwifi-1.2.25/compatible/iwl3945-base.c: In function 'iwl3945_mac_set_key':
/root/iwlwifi-1.2.25/compatible/iwl3945-base.c:7463: warning: too few arguments for format
/root/iwlwifi-1.2.25/compatible/iwl3945-base.c:7472: error: 'cmd' undeclared (first use in this function)
/root/iwlwifi-1.2.25/compatible/iwl3945-base.c: At top level:
/root/iwlwifi-1.2.25/compatible/iwl3945-base.c:8441: error: unknown field 'open' specified in initializer
/root/iwlwifi-1.2.25/compatible/iwl3945-base.c:8442: warning: initialization from incompatible pointer type
/root/iwlwifi-1.2.25/compatible/iwl3945-base.c:8447: warning: initialization from incompatible pointer type
/root/iwlwifi-1.2.25/compatible/iwl3945-base.c: In function 'iwl3945_pci_probe':
/root/iwlwifi-1.2.25/compatible/iwl3945-base.c:8516: error: 'IEEE80211_HW_WEP_INCLUDE_IV' undeclared (first use in this function)
/root/iwlwifi-1.2.25/compatible/iwl3945-base.c:8665: warning: too few arguments for format
make[3]: *** [/root/iwlwifi-1.2.25/compatible/iwl3945-base.o] Error 1
make[2]: *** [_module_/root/iwlwifi-1.2.25/compatible] Error 2
make[1]: *** [sub-make] Error 2
make[1]: Leaving directory `/usr/src/linux-2.6.24.3'
make: *** [modules] Error 2