All pastes #9421 Raw Edit

Mine!

public text v1 · immutable
#9421 ·published 2005-04-12 17:05 UTC
rendered paste body
wxcasframe.h:63: error: base class `wxFrame' has incomplete type
wxcasframe.h:65: error: syntax error before `*' token
wxcasframe.h:66: error: field `m_toolBarBitmaps' has incomplete type
wxcasframe.h:68: error: syntax error before `*' token
wxcasframe.h:69: error: syntax error before `*' token
wxcasframe.h:71: error: syntax error before `*' token
wxcasframe.h:73: error: syntax error before `*' token
wxcasframe.h:79: error: syntax error before `*' token
wxcasframe.h:80: error: syntax error before `*' token
wxcasframe.h:82: error: syntax error before `*' token
wxcasframe.h:83: error: syntax error before `*' token
wxcasframe.h:85: error: syntax error before `*' token
wxcasframe.h:86: error: syntax error before `*' token
wxcasframe.h:88: error: syntax error before `*' token
wxcasframe.h:89: error: syntax error before `*' token
wxcasframe.h:91: error: syntax error before `*' token
wxcasframe.h:92: error: syntax error before `*' token
wxcasframe.h:93: error: syntax error before `*' token
wxcasframe.h:94: error: syntax error before `*' token
wxcasframe.h:95: error: syntax error before `*' token
wxcasframe.h:96: error: syntax error before `*' token
wxcasframe.h:98: error: syntax error before `*' token
wxcasframe.h:99: error: syntax error before `*' token
wxcasframe.h:101: error: syntax error before `*' token
wxcasframe.h:102: error: syntax error before `*' token
wxcasframe.h:105: error: syntax error before `*' token
wxcasframe.h:106: error: syntax error before `*' token
wxcasframe.h:113: error: syntax error before `*' token
wxcasframe.h:114: error: syntax error before `*' token
wxcasframe.h:160: error: `wxCommandEvent' was not declared in this scope
wxcasframe.h:160: error: `event' was not declared in this scope
wxcasframe.h:160: error: invalid data member initialization
wxcasframe.h:160: error: (use `=' to initialize static data members)
wxcasframe.h:160: error: variable or field `OnBarRefresh' declared void
wxcasframe.h:161: error: `wxCommandEvent' was not declared in this scope
wxcasframe.h:161: error: `event' was not declared in this scope
wxcasframe.h:161: error: invalid data member initialization
wxcasframe.h:161: error: variable or field `OnBarAbout' declared void
wxcasframe.h:162: error: `wxCommandEvent' was not declared in this scope
wxcasframe.h:162: error: `event' was not declared in this scope
wxcasframe.h:162: error: invalid data member initialization
wxcasframe.h:162: error: variable or field `OnBarSave' declared void
wxcasframe.h:163: error: `wxCommandEvent' was not declared in this scope
wxcasframe.h:163: error: `event' was not declared in this scope
wxcasframe.h:163: error: invalid data member initialization
wxcasframe.h:163: error: variable or field `OnBarPrint' declared void
wxcasframe.h:164: error: `wxCommandEvent' was not declared in this scope
wxcasframe.h:164: error: `event' was not declared in this scope
wxcasframe.h:164: error: invalid data member initialization
wxcasframe.h:164: error: variable or field `OnBarPrefs' declared void
wxcasframe.h:165: error: `wxTimerEvent' was not declared in this scope
wxcasframe.h:165: error: `event' was not declared in this scope
wxcasframe.h:165: error: invalid data member initialization
wxcasframe.h:165: error: variable or field `OnRefreshTimer' declared void
wxcasframe.h:166: error: `wxTimerEvent' was not declared in this scope
wxcasframe.h:166: error: `event' was not declared in this scope
wxcasframe.h:166: error: invalid data member initialization
wxcasframe.h:166: error: variable or field `OnFtpUpdateTimer' declared void
wxcasframe.h:167: error: `wxCommandEvent' was not declared in this scope
wxcasframe.h:167: error: `event' was not declared in this scope
wxcasframe.h:167: error: invalid data member initialization
wxcasframe.h:167: error: variable or field `OnHitButton' declared void
wxcasframe.h:168: error: `wxCommandEvent' was not declared in this scope
wxcasframe.h:168: error: `event' was not declared in this scope
wxcasframe.h:168: error: invalid data member initialization
wxcasframe.h:168: error: variable or field `OnAbsHitButton' declared void
wxcasframe.h:63: warning: `class WxCasFrame' has virtual functions but non-virtual destructor
wxcas.cpp: In function `wxApp* wxCreateApp()':
wxcas.cpp:60: error: cannot allocate an object of type `WxCas'
wxcas.cpp:60: error:   because the following virtual functions are abstract:
/usr/include/wx/app.h:131: error:       virtual int wxAppBase::OnRun()
wxcas.cpp: In member function `virtual bool WxCas::OnInit()':
wxcas.cpp:71: error: parse error before `)' token
wxcas.cpp:76: error: parse error before `)' token
wxcas.cpp:84: error: `SetPrintMode' undeclared (first use this function)
wxcas.cpp:94: error: `Show' undeclared (first use this function)
wxcas.cpp:95: error: `SetTopWindow' undeclared (first use this function)
wxcas.cpp: At top level:
/usr/include/wx/font.h:95: warning: `wxFont* New(int, int, int, int, bool, const wxString&, wxFontEncoding)' declared `static' but never defined
/usr/include/wx/font.h:98: warning: `wxFont* New(const wxNativeFontInfo&)' declared `static' but never defined
/usr/include/wx/font.h:101: warning: `wxFont* New(const wxString&)' declared `static' but never defined
/usr/include/wx/font.h:151: warning: `void SetDefaultEncoding(wxFontEncoding)' declared `static' but never defined
make[4]: *** [wxcas-wxcas.o] Error 1
make[4]: Leaving directory `/home/gaio/Desktop/codec/aMule/src/utils/wxCas/src'
make[3]: *** [all-recursive] Error 1
make[3]: Leaving directory `/home/gaio/Desktop/codec/aMule/src/utils/wxCas'
make[2]: *** [all-recursive] Error 1
make[2]: Leaving directory `/home/gaio/Desktop/codec/aMule/src/utils'
make[1]: *** [all-recursive] Error 1
make[1]: Leaving directory `/home/gaio/Desktop/codec/aMule/src'
make: *** [all] Error 2