/home/fale/kbug/build/moc_buglist.cpp:37: error: ‘BugList’ has not been declared
/home/fale/kbug/build/moc_buglist.cpp:42: error: ‘BugList’ has not been declared
/home/fale/kbug/build/moc_buglist.cpp:42: error: non-member function ‘const QMetaObject* metaObject()’ cannot have cv-qualifier
/home/fale/kbug/build/moc_buglist.cpp:47: error: ‘BugList’ has not been declared
/home/fale/kbug/build/moc_buglist.cpp: In function ‘void* qt_metacast(const char*)’:
/home/fale/kbug/build/moc_buglist.cpp:51: error: expected type-specifier before ‘BugList’
/home/fale/kbug/build/moc_buglist.cpp:51: error: expected `>' before ‘BugList’
/home/fale/kbug/build/moc_buglist.cpp:51: error: expected `(' before ‘BugList’
/home/fale/kbug/build/moc_buglist.cpp:51: error: ‘BugList’ was not declared in this scope
/home/fale/kbug/build/moc_buglist.cpp:51: error: expected primary-expression before ‘>’ token
/home/fale/kbug/build/moc_buglist.cpp:51: error: invalid use of ‘this’ in non-member function
/home/fale/kbug/build/moc_buglist.cpp:51: error: expected `)' before ‘;’ token
/home/fale/kbug/build/moc_buglist.cpp:52: error: cannot call member function ‘virtual void* QWidget::qt_metacast(const char*)’ without object
/home/fale/kbug/build/moc_buglist.cpp: At global scope:
/home/fale/kbug/build/moc_buglist.cpp:55: error: ‘BugList’ has not been declared
/home/fale/kbug/build/moc_buglist.cpp: In function ‘int qt_metacall(QMetaObject::Call, int, void**)’:
/home/fale/kbug/build/moc_buglist.cpp:57: error: cannot call member function ‘virtual int QWidget::qt_metacall(QMetaObject::Call, int, void**)’ without object
make[2]: *** [CMakeFiles/KBugBuster.dir/KBugBuster_automoc.o] Error 1
make[1]: *** [CMakeFiles/KBugBuster.dir/all] Error 2
make: *** [all] Error 2
makeobj[0]: Leaving directory `/home/fale/kbug/build'
fale@fale-laptop:~/kbug/build$