All pastes #941047 Raw Edit

Something

public text v1 · immutable
·published 2008-03-13 14:00 UTC
rendered paste body
C:\kderoot\etc>kdesettings.bat
kdesettings.bat executed
KDEROOT     : c:\kderoot
KDECOMPILER : mingw
KDESVNDIR   : c:\kderoot\svn
PYTHONPATH  : c:\python25
DOWNLOADDIR : c:\kderoot\download
C:\kderoot\etc>cd ..\emerge\bin

C:\kderoot\emerge\bin>emerge qt

C:\kderoot\emerge\bin>echo emerge.bat executed
emerge.bat executed

C:\kderoot\emerge\bin>python c:\kderoot\emerge\bin\emerge.py qt
buildAction: all
doPretend: False
packageName: qt
buildType: RelWithDebInfo
buildTests: None
verbose: 1
KDEROOT: c:\kderoot
setdir category: libs, package: qt, version: 4.4.0.20080222
cmakeInstallPrefix: c:/kderoot
--10:53:02--  http://82.149.170.66/kde-windows/repository/win32libs/single/opens
sl-0.9.8g-1-lib.zip
           => `c:/kderoot/download/openssl-0.9.8g-1-lib.zip'
Connecting to 82.149.170.66:80... connected.
HTTP request sent, awaiting response... 416 Requested Range Not Satisfiable

    The file is already fully retrieved; nothing to do.

wget ret: True
--10:53:02--  http://download.cegit.de/kde-windows/repository/win32libs/single/d
bus-mingw-1.1.2.20080216-lib.tar.bz2
           => `c:/kderoot/download/dbus-mingw-1.1.2.20080216-lib.tar.bz2'
Resolving download.cegit.de... 82.149.170.66
Connecting to download.cegit.de|82.149.170.66|:80... connected.
HTTP request sent, awaiting response... 416 Requested Range Not Satisfiable

    The file is already fully retrieved; nothing to do.

wget ret: True
setdir category: libs, package: qt, version: 4.4.0.20080222
cmakeInstallPrefix: c:/kderoot
ksco exists: c:\kderoot\svn trunk
dir in which to really checkout: c:\kderoot\svn\trunk
dir to really checkout: qt-copy
Na revisão 785200.
patching file tools\qdbus\qdbuscpp2xml\qdbuscpp2xml.pro
patching file tools\qdbus\qdbusxml2cpp\qdbusxml2cpp.pro
patching file tools\qdbus\qdbusviewer\qdbusviewer.pro
setdir category: libs, package: qt, version: 4.4.0.20080222
cmakeInstallPrefix: c:/kderoot
command:  echo y | configure.exe -platform win32-g++ -prefix c:\kderoot\tmp\qt-4
.4.0.20080222\image-mingw\ -qt-gif -qt-libpng -qt-libjpeg -qt-libtiff -qdbus -op
enssl -fast -no-vcproj -no-dsp -I c:\kderoot\tmp\qt-4.4.0.20080222\work\3rdparty
\include -L c:\kderoot\tmp\qt-4.4.0.20080222\work\3rdparty\lib  -release

This is the Qt/Windows Open Source Edition.

You are licensed to use this software under the terms of
the GNU General Public License (GPL) version 2 or 3.

Type '2' to view the GNU General Public License version 2 (GPLv2).
Type '3' to view the GNU General Public License version 3 (GPLv3).
Type 'y' to accept this license offer.
Type 'n' to decline this license offer.

Do you accept the terms of the license?
Setting Direct3D to NO, since the proper Direct3D SDK was not detected.
Make sure you have the Direct3D SDK installed, and that you have run
the <path to SDK>\Utilities\Bin\dx_setenv.cmd script.
The D3D SDK library path *needs* to appear before the Platform SDK library
path in your LIB environment variable.
A platform SDK containing all the DirectShow files couldn't be found.
Make sure you have the Microsoft Platform/Windows SDK installed,
and that you have run the <path to SDK>\SetEnv.Cmd script.
Environment:
    INCLUDE=
      Unset
    LIB=
      Unset
    PATH=
      c:\python25
      C:\WINDOWS\system32
      C:\WINDOWS
      C:\WINDOWS\System32\Wbem
      C:\Arquivos de programas\QuickTime\QTSystem\
      C:\Qt\4.3.4\bin\
      C:\Arquivos de programas\CodeBlocks\MinGW\bin\
      C:\Arquivos de programas\Subversion\bin
      C:\Program Files\Subversion\iconv
      C:\kderoot\bin
      C:\msys\bin
You are licensed to use this software under the terms of the GNU GPL version 2 o
r 3.
See C:/kderoot/tmp/qt-4.4.0.20080222/work/qt-win-opensource-src-mingw/LICENSE.GP
L2
 or C:/kderoot/tmp/qt-4.4.0.20080222/work/qt-win-opensource-src-mingw/LICENSE.GP
L3

Configuration:
    dist-config
    large-config
    medium-config
    minimal-config
    small-config
    full-config
    release
Qt Configuration:
    release
    zlib
    png
    accessibility
    qt3support
    opengl
    openssl
    qdbus
    ipv6
    xmlpatterns
    webkit
    minimal-config
    small-config
    medium-config
    large-config
    full-config

QMAKESPEC...................win32-g++ (commandline)
Architecture................windows
Maketool....................mingw32-make
Debug symbols...............no
Accessibility support.......yes
STL support.................yes
Exception support...........yes
RTTI support................yes
MMX support.................no
3DNOW support...............no
SSE support.................no
SSE2 support................no
IWMMXT support..............no
OpenGL support..............yes
Direct3D support............no
OpenSSL support.............yes
QtDBus support..............yes
QtXmlPatterns support.......yes
Phonon support..............no
WebKit support..............yes
Qt3 compatibility...........yes

Third Party Libraries:
    ZLIB support............qt
    GIF support.............plugin
    TIFF support............plugin
    JPEG support............plugin
    PNG support.............qt
    MNG support.............plugin

Styles:
    Windows.................yes
    Windows XP..............yes
    Windows Vista...........yes
    Plastique...............yes
    Cleanlooks..............yes
    Motif...................yes
    CDE.....................yes
    Windows CE..............no
    Windows Mobile..........no

Sql Drivers:
    ODBC....................no
    MySQL...................no
    OCI.....................no
    PostgreSQL..............no
    TDS.....................no
    DB2.....................no
    SQLite..................plugin (qt)
    SQLite2.................no
    InterBase...............no

Sources are in..............C:\kderoot\tmp\qt-4.4.0.20080222\work\qt-win-opensou
rce-src-mingw
Build is done in............C:\kderoot\tmp\qt-4.4.0.20080222\work\qt-win-opensou
rce-src-mingw
Install prefix..............c:\kderoot\tmp\qt-4.4.0.20080222\image-mingw\
Headers installed to........c:/kderoot/tmp/qt-4.4.0.20080222/image-mingw//includ
e
Libraries installed to......c:/kderoot/tmp/qt-4.4.0.20080222/image-mingw//lib
Plugins installed to........c:/kderoot/tmp/qt-4.4.0.20080222/image-mingw//plugin
s
Binaries installed to.......c:/kderoot/tmp/qt-4.4.0.20080222/image-mingw//bin
Docs installed to...........c:/kderoot/tmp/qt-4.4.0.20080222/image-mingw//doc
Data installed to...........c:/kderoot/tmp/qt-4.4.0.20080222/image-mingw/
Translations installed to...c:/kderoot/tmp/qt-4.4.0.20080222/image-mingw//transl
ations
Examples installed to.......c:/kderoot/tmp/qt-4.4.0.20080222/image-mingw//exampl
es
Demos installed to..........c:/kderoot/tmp/qt-4.4.0.20080222/image-mingw//demos

Include paths...............c:\kderoot\tmp\qt-4.4.0.20080222\work\3rdparty\inclu
de
Additional libraries........-Lc:\kderoot\tmp\qt-4.4.0.20080222\work\3rdparty\lib

Running syncqt...
Can't find syncqt on PATH.
Creating qmake...
g++ -c -oproject.o -O -I. -Igenerators -Igenerators/unix -Igenerators/win32 -Ige
nerators/mac -IC:\kderoot\tmp\qt-4.4.0.20080222\work\qt-win-opensource-src-mingw
/include -IC:\kderoot\tmp\qt-4.4.0.20080222\work\qt-win-opensource-src-mingw/inc
lude/QtCore -IC:\kderoot\tmp\qt-4.4.0.20080222\work\qt-win-opensource-src-mingw/
include -IC:\kderoot\tmp\qt-4.4.0.20080222\work\qt-win-opensource-src-mingw/incl
ude/QtCore -IC:\kderoot\tmp\qt-4.4.0.20080222\work\qt-win-opensource-src-mingw/s
rc/corelib/global -IC:\kderoot\tmp\qt-4.4.0.20080222\work\qt-win-opensource-src-
mingw/include/QtScript -IC:\kderoot\tmp\qt-4.4.0.20080222\work\qt-win-opensource
-src-mingw/mkspecs/win32-g++ -DQT_NO_TEXTCODEC -DQT_NO_UNICODETABLES -DQT_LITE_C
OMPONENT -DQT_NO_PCRE -DQT_NODLL -DQT_NO_STL -DQT_NO_COMPRESS -DUNICODE -DHAVE_Q
CONFIG_CPP -DQT_BUILD_QMAKE -DQT_NO_THREAD -DQT_NO_QOBJECT -DQT_NO_GEOM_VARIANT
-DQT_NO_DATASTREAM -DQMAKE_OPENSOURCE_EDITION project.cpp
In file included from project.cpp:44:
project.h:47:25: qstringlist.h: No such file or directory
project.h:48:25: qtextstream.h: No such file or directory
project.h:49:21: qstring.h: No such file or directory
project.h:50:20: qstack.h: No such file or directory
project.h:51:18: qmap.h: No such file or directory
project.h:52:23: qmetatype.h: No such file or directory
project.h:59:28: qscriptengine.h: No such file or directory
In file included from project.cpp:44:
project.h:64: error: expected constructor, destructor, or type conversion before
 "class"
project.h:79: error: `uint' does not name a type
project.h:86: error: `QScriptEngine' does not name a type
project.h:88: error: ISO C++ forbids declaration of `QStack' with no type
project.h:88: error: expected `;' before '<' token
project.h:89: error: ISO C++ forbids declaration of `QStack' with no type
project.h:89: error: expected `;' before '<' token
project.h:92: error: ISO C++ forbids declaration of `QMap' with no type
project.h:92: error: expected `;' before '<' token
project.h:95: error: `QString' does not name a type
project.h:96: error: ISO C++ forbids declaration of `QMakeProperty' with no type

project.h:96: error: expected `;' before '*' token
project.h:98: error: ISO C++ forbids declaration of `QMap' with no type
project.h:98: error: expected `;' before '<' token
project.h:99: error: expected `,' or `...' before '&' token
project.h:99: error: ISO C++ forbids declaration of `QString' with no type
project.h:114: error: `QString' has not been declared
project.h:114: error: `uchar' has not been declared
project.h:114: error: `QMap' has not been declared
project.h:114: error: expected `,' or `...' before '<' token
project.h:114: error: ISO C++ forbids declaration of `file' with no type
project.h:114: error: ISO C++ forbids declaration of `flags' with no type
project.h:114: error: ISO C++ forbids declaration of `parameter' with no type
project.h:116: error: expected `,' or `...' before '&' token
project.h:116: error: ISO C++ forbids declaration of `QStringList' with no type
project.h:117: error: `QString' has not been declared
project.h:117: error: `QMap' has not been declared
project.h:117: error: expected `,' or `...' before '<' token
project.h:117: error: ISO C++ forbids declaration of `str' with no type
project.h:117: error: ISO C++ forbids declaration of `parameter' with no type
project.h:118: error: `QStringList' does not name a type
project.h:119: error: `QMakeProperty' has not been declared
project.h:119: error: expected `,' or `...' before '<' token
project.h:119: error: ISO C++ forbids declaration of `parameter' with no type
project.h:119: error: ISO C++ forbids declaration of `QMap' with no type
project.h:120: error: ISO C++ forbids declaration of `QStringList' with no type
project.h:120: error: expected `;' before '&' token
project.h:124: error: expected `)' before '*' token
project.h:125: error: expected `,' or `...' before '<' token
project.h:125: error: ISO C++ forbids declaration of `QMap' with no type
project.h:126: error: expected `,' or `...' before '<' token
project.h:126: error: ISO C++ forbids declaration of `QMap' with no type
project.h:127: error: expected `)' before '*' token
project.h:132: error: expected `,' or `...' before '&' token
project.h:132: error: ISO C++ forbids declaration of `QString' with no type
project.h:132: error: `bool QMakeProject::parse(int)' and `bool QMakeProject::pa
rse(int)' cannot be overloaded
project.h:133: error: expected `,' or `...' before '&' token
project.h:133: error: ISO C++ forbids declaration of `QString' with no type
project.h:134: error: `uchar' has not been declared
project.h:134: error: ISO C++ forbids declaration of `cmd' with no type
project.h:134: error: `bool QMakeProject::read(int)' and `bool QMakeProject::rea
d(int)' cannot be overloaded
project.h:136: error: `QStringList' does not name a type
project.h:137: error: `QStringList' does not name a type
project.h:139: error: `QString' does not name a type
project.h:140: error: `QString' does not name a type
project.h:141: error: ISO C++ forbids declaration of `QMakeProperty' with no typ
e
project.h:141: error: `QMakeProperty' declared as an `inline' field
project.h:141: error: expected `;' before '*' token
project.h:143: error: expected `;' before "bool"
project.h:143: error: `QString' has not been declared
project.h:143: error: `QMap' has not been declared
project.h:143: error: expected `,' or `...' before '<' token
project.h:143: error: ISO C++ forbids declaration of `str' with no type
project.h:143: error: ISO C++ forbids declaration of `parameter' with no type
project.h:144: error: `QString' has not been declared
project.h:144: error: expected `,' or `...' before '&' token
project.h:145: error: ISO C++ forbids declaration of `func' with no type
project.h:145: error: ISO C++ forbids declaration of `QString' with no type
project.h:145: error: `bool QMakeProject::doProjectTest(int, int)' and `bool QMa
keProject::doProjectTest(int, int)' cannot be overloaded
project.h:146: error: `QString' has not been declared
project.h:146: error: `QStringList' has not been declared
project.h:147: error: `QMap' has not been declared
project.h:147: error: expected `,' or `...' before '<' token
project.h:147: error: ISO C++ forbids declaration of `func' with no type
project.h:147: error: ISO C++ forbids declaration of `args' with no type
project.h:147: error: ISO C++ forbids declaration of `parameter' with no type
project.h:148: error: `QString' has not been declared
project.h:148: error: `QList' has not been declared
project.h:148: error: expected `,' or `...' before '<' token
project.h:149: error: ISO C++ forbids declaration of `func' with no type
project.h:149: error: ISO C++ forbids declaration of `parameter' with no type
project.h:149: error: `bool QMakeProject::doProjectTest(int, int)' and `bool QMa
keProject::doProjectTest(int, int)' cannot be overloaded
project.h:150: error: `QStringList' does not name a type
project.h:152: error: `QStringList' does not name a type
project.h:154: error: `QStringList' does not name a type
project.h:157: error: `QStringList' does not name a type
project.h:158: error: `QStringList' does not name a type
project.h:159: error: expected `,' or `...' before '&' token
project.h:159: error: ISO C++ forbids declaration of `QString' with no type
project.h:160: error: expected `,' or `...' before '&' token
project.h:160: error: ISO C++ forbids declaration of `QString' with no type
project.h:160: error: `bool QMakeProject::test(int)' and `bool QMakeProject::tes
t(int)' cannot be overloaded
project.h:161: error: expected `,' or `...' before '&' token
project.h:162: error: ISO C++ forbids declaration of `QString' with no type
project.h:164: error: expected `,' or `...' before '&' token
project.h:164: error: ISO C++ forbids declaration of `QString' with no type
project.h:165: error: expected `,' or `...' before '&' token
project.h:165: error: ISO C++ forbids declaration of `QString' with no type
project.h:166: error: ISO C++ forbids declaration of `QStringList' with no type
project.h:166: error: expected `;' before '&' token
project.h:167: error: `QString' does not name a type
project.h:168: error: ISO C++ forbids declaration of `QMap' with no type
project.h:168: error: expected `;' before '<' token
project.h:172: error: expected `,' or `...' before '&' token
project.h:172: error: ISO C++ forbids declaration of `QString' with no type
project.h:172: error: `bool QMakeProject::read(int)' and `bool QMakeProject::rea
d(int)' cannot be overloaded
project.h:173: error: `QTextStream' has not been declared
project.h:173: error: `QMap' has not been declared
project.h:173: error: expected `,' or `...' before '<' token
project.h:173: error: ISO C++ forbids declaration of `file' with no type
project.h:173: error: ISO C++ forbids declaration of `parameter' with no type
project.h: In constructor `QMakeProject::ScopeBlock::ScopeBlock()':
project.h:75: error: class `QMakeProject::ScopeBlock' does not have any field na
med `ignore'
project.h:75: error: class `QMakeProject::ScopeBlock' does not have any field na
med `else_status'
project.h: In constructor `QMakeProject::ScopeBlock::ScopeBlock(bool)':
project.h:76: error: class `QMakeProject::ScopeBlock' does not have any field na
med `ignore'
project.h:76: error: class `QMakeProject::ScopeBlock' does not have any field na
med `else_status'
project.h: In constructor `QMakeProject::QMakeProject(int)':
project.h:126: error: `nvars' was not declared in this scope
project.h: In member function `bool QMakeProject::parse(int)':
project.h:132: error: `text' was not declared in this scope
project.h:132: error: `vars' was not declared in this scope
project.h: At global scope:
project.h:178: error: expected constructor, destructor, or type conversion befor
e "inline"
project.h:185: error: `QString' does not name a type
project.h:188: error: expected initializer before '&' token
project.h:191: error: expected `,' or `...' before '&' token
project.h:192: error: ISO C++ forbids declaration of `QString' with no type
project.h: In member function `bool QMakeProject::isEmpty(int)':
project.h:192: error: `v' was not declared in this scope
project.h:192: error: `values' was not declared in this scope
project.h: At global scope:
project.h:194: error: expected `,' or `...' before '&' token
project.h:195: error: ISO C++ forbids declaration of `QString' with no type
project.h: In member function `bool QMakeProject::isSet(int)':
project.h:195: error: `vars' was not declared in this scope
project.h:195: error: `v' was not declared in this scope
project.h: At global scope:
project.h:197: error: `QString' does not name a type
project.h:205: error: expected initializer before '<' token
In file included from project.cpp:45:
property.h:47:21: qglobal.h: No such file or directory
In file included from project.cpp:45:
project.h:208: error: `QT_END_NAMESPACE' does not name a type
property.h:56: error: ISO C++ forbids declaration of `QSettings' with no type
property.h:56: error: expected `;' before '*' token
property.h:58: error: `QString' does not name a type
property.h:59: error: `QString' does not name a type
property.h:64: error: `QString' has not been declared
property.h:64: error: ISO C++ forbids declaration of `parameter' with no type
property.h:65: error: `QString' does not name a type
property.h:66: error: `QString' has not been declared
property.h:66: error: expected `,' or `...' before '&' token
property.h:66: error: ISO C++ forbids declaration of `parameter' with no type
property.h:66: error: ISO C++ forbids declaration of `QString' with no type
In file included from project.cpp:46:
option.h:50:19: qfile.h: No such file or directory
In file included from project.cpp:46:
property.h:71: error: `QT_END_NAMESPACE' does not name a type
option.h:59: error: `QString' does not name a type
option.h:60: error: expected `,' or `...' before '&' token
option.h:60: error: ISO C++ forbids declaration of `QString' with no type
option.h:75: error: `QString' does not name a type
option.h:76: error: `QString' does not name a type
option.h:77: error: `QString' does not name a type
option.h:78: error: `QString' does not name a type
option.h:79: error: `QString' does not name a type
option.h:80: error: `QString' does not name a type
option.h:81: error: `QStringList' does not name a type
option.h:82: error: `QStringList' does not name a type
option.h:83: error: `QStringList' does not name a type
option.h:84: error: `QString' does not name a type
option.h:85: error: `QString' does not name a type
option.h:86: error: `QString' does not name a type
option.h:87: error: `QString' does not name a type
option.h:88: error: `QString' does not name a type
option.h:89: error: `QString' does not name a type
option.h:90: error: `QString' does not name a type
option.h:91: error: `QString' does not name a type
option.h:92: error: `QString' does not name a type
option.h:93: error: `QString' does not name a type
option.h:94: error: `QString' does not name a type
option.h:95: error: `QString' does not name a type
option.h:96: error: `QString' does not name a type
option.h:97: error: `QString' does not name a type
option.h:119: error: `QString' does not name a type
option.h:122: error: `QString' does not name a type
option.h:131: error: `QString' does not name a type
option.h:147: error: `QString' does not name a type
option.h:148: error: `QFile' does not name a type
option.h:149: error: `QString' does not name a type
option.h:153: error: `QStringList' does not name a type
option.h:156: error: `QString' does not name a type
option.h:157: error: `QStringList' does not name a type
option.h:161: error: `QStringList' does not name a type
option.h:167: error: `QStringList' does not name a type
option.h:172: error: `QString' does not name a type
option.h:179: error: `QString' does not name a type
option.h:181: error: `QStringList' does not name a type
option.h:182: error: `QString' does not name a type
option.h:189: error: `QString' does not name a type
option.h:190: error: `QStringList' does not name a type
option.h:211: error: `QString' does not name a type
In file included from project.cpp:47:
cachekeys.h:51:23: qfileinfo.h: No such file or directory
cachekeys.h:52:19: qhash.h: No such file or directory
In file included from project.cpp:47:
option.h:214: error: `QT_END_NAMESPACE' does not name a type
cachekeys.h:82: error: `uint' does not name a type
cachekeys.h:87: error: `uint' does not name a type
cachekeys.h:88: error: `QString' does not name a type
cachekeys.h:89: error: expected `,' or `...' before '&' token
cachekeys.h:90: error: ISO C++ forbids declaration of `QString' with no type
cachekeys.h:101: error: `uint' does not name a type
cachekeys.h:106: error: expected `,' or `...' before '&' token
cachekeys.h:106: error: ISO C++ forbids declaration of `QString' with no type
cachekeys.h: In constructor `FileInfoCacheKey::FileInfoCacheKey(int)':
cachekeys.h:91: error: `hash' was not declared in this scope
cachekeys.h:92: error: `f' was not declared in this scope
cachekeys.h:93: error: `pwd' was not declared in this scope
cachekeys.h:93: error: `qmake_getpwd' was not declared in this scope
cachekeys.h:94: error: `file' was not declared in this scope
cachekeys.h:94: error: `f' was not declared in this scope
cachekeys.h: In member function `bool FileInfoCacheKey::operator==(const FileInf
oCacheKey&) const':
cachekeys.h:98: error: `hashCode' was not declared in this scope
cachekeys.h:98: error: 'const struct FileInfoCacheKey' has no member named 'hash
Code'
cachekeys.h:98: error: 'const struct FileInfoCacheKey' has no member named 'file
'
cachekeys.h:98: error: `file' was not declared in this scope
cachekeys.h:99: error: 'const struct FileInfoCacheKey' has no member named 'pwd'

cachekeys.h:99: error: `pwd' was not declared in this scope
cachekeys.h: In member function `bool FileInfoCacheKey::isRelativePath(int)':
cachekeys.h:107: error: `file' was not declared in this scope
cachekeys.h:111: error: `QChar' does not name a type
cachekeys.h:112: error: `QChar' does not name a type
cachekeys.h:113: error: `c0' was not declared in this scope
cachekeys.h:113: error: `QLatin1Char' was not declared in this scope
cachekeys.h:115: error: `c1' was not declared in this scope
cachekeys.h: At global scope:
cachekeys.h:120: error: `uint' does not name a type
cachekeys.h:125: error: `uint' does not name a type
cachekeys.h:126: error: `QString' does not name a type
cachekeys.h:127: error: `QString' does not name a type
cachekeys.h:128: error: `uint' does not name a type
cachekeys.h:130: error: expected `,' or `...' before '&' token
cachekeys.h:132: error: ISO C++ forbids declaration of `QString' with no type
cachekeys.h:147: error: `QString' does not name a type
cachekeys.h:160: error: `uint' does not name a type
cachekeys.h: In constructor `FileFixifyCacheKey::FileFixifyCacheKey(int)':
cachekeys.h:133: error: `hash' was not declared in this scope
cachekeys.h:134: error: `pwd' was not declared in this scope
cachekeys.h:134: error: `qmake_getpwd' was not declared in this scope
cachekeys.h:135: error: `file' was not declared in this scope
cachekeys.h:135: error: `f' was not declared in this scope
cachekeys.h:136: error: `od' was not declared in this scope
cachekeys.h:137: error: `out_d' was not declared in this scope
cachekeys.h:137: error: `output_dir' is not a member of `Option'
cachekeys.h:139: error: `out_d' was not declared in this scope
cachekeys.h:140: error: `id' was not declared in this scope
cachekeys.h:141: error: `in_d' was not declared in this scope
cachekeys.h:143: error: `in_d' was not declared in this scope
cachekeys.h:144: error: `fixType' was not declared in this scope
cachekeys.h:144: error: `ft' was not declared in this scope
cachekeys.h:145: error: `c' was not declared in this scope
cachekeys.h: In member function `bool FileFixifyCacheKey::operator==(const FileF
ixifyCacheKey&) const':
cachekeys.h:154: error: 'const struct FileFixifyCacheKey' has no member named 'f
ixType'
cachekeys.h:154: error: `fixType' was not declared in this scope
cachekeys.h:155: error: 'const struct FileFixifyCacheKey' has no member named 'f
ile'
cachekeys.h:155: error: `file' was not declared in this scope
cachekeys.h:156: error: 'const struct FileFixifyCacheKey' has no member named 'i
n_d'
cachekeys.h:156: error: `in_d' was not declared in this scope
cachekeys.h:157: error: 'const struct FileFixifyCacheKey' has no member named 'o
ut_d'
cachekeys.h:157: error: `out_d' was not declared in this scope
cachekeys.h:158: error: 'const struct FileFixifyCacheKey' has no member named 'p
wd'
cachekeys.h:158: error: `pwd' was not declared in this scope
cachekeys.h: At global scope:
cachekeys.h:168: error: `uint' does not name a type
cachekeys.h: In function `void qmakeDeleteCacheClear_QMapStringInt(void*)':
cachekeys.h:172: error: `QMap' has not been declared
cachekeys.h:172: error: expected `>' before '<' token
cachekeys.h:172: error: expected `(' before '<' token
cachekeys.h:172: error: expected primary-expression before '<' token
cachekeys.h:172: error: `QString' was not declared in this scope
cachekeys.h:172: error: expected primary-expression before "int"
cachekeys.h:172: error: expected `)' before "int"
cachekeys.h:172: error: expected `;' before "int"
cachekeys.h: In function `void qmakeDeleteCacheClear_QStringList(void*)':
cachekeys.h:173: error: `QStringList' has not been declared
cachekeys.h:173: error: expected `>' before '*' token
cachekeys.h:173: error: expected `(' before '*' token
cachekeys.h:173: error: expected primary-expression before '>' token
cachekeys.h:173: error: expected `)' before ';' token
cachekeys.h: In function `void qmakeDeleteCacheClear_QHashFixStringCacheKeyQStri
ng(void*)':
cachekeys.h:174: error: `QHash' has not been declared
cachekeys.h:174: error: expected `>' before '<' token
cachekeys.h:174: error: expected `(' before '<' token
cachekeys.h:174: error: expected primary-expression before '<' token
cachekeys.h:174: error: `FixStringCacheKey' was not declared in this scope
cachekeys.h:174: error: `QString' was not declared in this scope
cachekeys.h:174: error: expected primary-expression before '>' token
cachekeys.h:174: error: expected `)' before ';' token
cachekeys.h: In function `void qmakeDeleteCacheClear_QHashFileInfoCacheKeyQFileI
nfo(void*)':
cachekeys.h:175: error: `QHash' has not been declared
cachekeys.h:175: error: expected `>' before '<' token
cachekeys.h:175: error: expected `(' before '<' token
cachekeys.h:175: error: expected primary-expression before '<' token
cachekeys.h:175: error: expected primary-expression before ',' token
cachekeys.h:175: error: `QFileInfo' was not declared in this scope
cachekeys.h:175: error: expected primary-expression before '>' token
cachekeys.h:175: error: expected `)' before ';' token
cachekeys.h: In function `void qmakeDeleteCacheClear_QHashFileFixifyCacheKeyQStr
ing(void*)':
cachekeys.h:176: error: `QHash' has not been declared
cachekeys.h:176: error: expected `>' before '<' token
cachekeys.h:176: error: expected `(' before '<' token
cachekeys.h:176: error: expected primary-expression before '<' token
cachekeys.h:176: error: expected primary-expression before ',' token
cachekeys.h:176: error: `QString' was not declared in this scope
cachekeys.h:176: error: expected primary-expression before '>' token
cachekeys.h:176: error: expected `)' before ';' token
cachekeys.h: In function `void qmakeFreeCacheClear(void*)':
cachekeys.h:177: error: `free' was not declared in this scope
project.cpp:49:23: qdatetime.h: No such file or directory
project.cpp:52:18: qdir.h: No such file or directory
project.cpp:53:21: qregexp.h: No such file or directory
project.cpp:57:20: qdebug.h: No such file or directory
In file included from c:/Arquivos de programas/CodeBlocks/MinGW/bin/../lib/gcc/m
ingw32/3.4.5/../../../../include/stdio.h:26,
                 from project.cpp:64:
c:/Arquivos de programas/CodeBlocks/MinGW/bin/../lib/gcc/mingw32/3.4.5/include/s
tddef.h: At global scope:
c:/Arquivos de programas/CodeBlocks/MinGW/bin/../lib/gcc/mingw32/3.4.5/include/s
tddef.h:213: error: expected constructor, destructor, or type conversion before
"typedef"
In file included from project.cpp:64:
c:/Arquivos de programas/CodeBlocks/MinGW/bin/../lib/gcc/mingw32/3.4.5/../../../
../include/stdio.h:191: error: `size_t' has not been declared
c:/Arquivos de programas/CodeBlocks/MinGW/bin/../lib/gcc/mingw32/3.4.5/../../../
../include/stdio.h:202: error: `size_t' has not been declared
c:/Arquivos de programas/CodeBlocks/MinGW/bin/../lib/gcc/mingw32/3.4.5/../../../
../include/stdio.h:206: error: `size_t' has not been declared
c:/Arquivos de programas/CodeBlocks/MinGW/bin/../lib/gcc/mingw32/3.4.5/../../../
../include/stdio.h:216: error: `size_t' has not been declared
c:/Arquivos de programas/CodeBlocks/MinGW/bin/../lib/gcc/mingw32/3.4.5/../../../
../include/stdio.h:217: error: `size_t' has not been declared
c:/Arquivos de programas/CodeBlocks/MinGW/bin/../lib/gcc/mingw32/3.4.5/../../../
../include/stdio.h:297: error: expected constructor, destructor, or type convers
ion before "fread"
c:/Arquivos de programas/CodeBlocks/MinGW/bin/../lib/gcc/mingw32/3.4.5/../../../
../include/stdio.h:298: error: expected constructor, destructor, or type convers
ion before "fwrite"
In file included from project.cpp:64:
c:/Arquivos de programas/CodeBlocks/MinGW/bin/../lib/gcc/mingw32/3.4.5/../../../
../include/stdio.h:446: error: `size_t' has not been declared
c:/Arquivos de programas/CodeBlocks/MinGW/bin/../lib/gcc/mingw32/3.4.5/../../../
../include/stdio.h:450: error: `size_t' has not been declared
c:/Arquivos de programas/CodeBlocks/MinGW/bin/../lib/gcc/mingw32/3.4.5/../../../
../include/stdio.h:480: error: `size_t' has not been declared
c:/Arquivos de programas/CodeBlocks/MinGW/bin/../lib/gcc/mingw32/3.4.5/../../../
../include/stdio.h:482: error: `size_t' has not been declared
In file included from project.cpp:65:
c:/Arquivos de programas/CodeBlocks/MinGW/bin/../lib/gcc/mingw32/3.4.5/../../../
../include/stdlib.h:335: error: `size_t' has not been declared
c:/Arquivos de programas/CodeBlocks/MinGW/bin/../lib/gcc/mingw32/3.4.5/../../../
../include/stdlib.h:340: error: expected constructor, destructor, or type conver
sion before "wcstombs"
c:/Arquivos de programas/CodeBlocks/MinGW/bin/../lib/gcc/mingw32/3.4.5/../../../
../include/stdlib.h:343: error: `size_t' has not been declared
c:/Arquivos de programas/CodeBlocks/MinGW/bin/../lib/gcc/mingw32/3.4.5/../../../
../include/stdlib.h:344: error: expected constructor, destructor, or type conver
sion before "mbstowcs"
c:/Arquivos de programas/CodeBlocks/MinGW/bin/../lib/gcc/mingw32/3.4.5/../../../
../include/stdlib.h:345: error: `size_t' has not been declared
c:/Arquivos de programas/CodeBlocks/MinGW/bin/../lib/gcc/mingw32/3.4.5/../../../
../include/stdlib.h:350: error: `size_t' was not declared in this scope
c:/Arquivos de programas/CodeBlocks/MinGW/bin/../lib/gcc/mingw32/3.4.5/../../../
../include/stdlib.h:350: error: `size_t' was not declared in this scope
c:/Arquivos de programas/CodeBlocks/MinGW/bin/../lib/gcc/mingw32/3.4.5/../../../
../include/stdlib.h:350: error: initializer expression list treated as compound
expression
c:/Arquivos de programas/CodeBlocks/MinGW/bin/../lib/gcc/mingw32/3.4.5/../../../
../include/stdlib.h:351: error: `size_t' was not declared in this scope
c:/Arquivos de programas/CodeBlocks/MinGW/bin/../lib/gcc/mingw32/3.4.5/../../../
../include/stdlib.h:352: error: `size_t' has not been declared
c:/Arquivos de programas/CodeBlocks/MinGW/bin/../lib/gcc/mingw32/3.4.5/../../../
../include/stdlib.h:364: error: `size_t' has not been declared
c:/Arquivos de programas/CodeBlocks/MinGW/bin/../lib/gcc/mingw32/3.4.5/../../../
../include/stdlib.h:364: error: `size_t' has not been declared
c:/Arquivos de programas/CodeBlocks/MinGW/bin/../lib/gcc/mingw32/3.4.5/../../../
../include/stdlib.h:366: error: `size_t' has not been declared
c:/Arquivos de programas/CodeBlocks/MinGW/bin/../lib/gcc/mingw32/3.4.5/../../../
../include/stdlib.h:366: error: `size_t' has not been declared
c:/Arquivos de programas/CodeBlocks/MinGW/bin/../lib/gcc/mingw32/3.4.5/../../../
../include/stdlib.h:414: error: `size_t' has not been declared
project.cpp:76: error: expected constructor, destructor, or type conversion befo
re "enum"
project.cpp:80: error: expected constructor, destructor, or type conversion befo
re '<' token
project.cpp:119: error: expected constructor, destructor, or type conversion bef
ore '<' token
project.cpp:159:26: qscriptvalue.h: No such file or directory
project.cpp:161:34: qscriptvalueiterator.h: No such file or directory
project.cpp:156: error: `QT_END_NAMESPACE' does not name a type
project.cpp:168: error: `QMap' was not declared in this scope
project.cpp:168: error: `QString' was not declared in this scope
project.cpp:168: error: `QStringList' was not declared in this scope
project.cpp:168: error: `vars' was not declared in this scope
project.cpp:168: error: `QScriptValue' was not declared in this scope
project.cpp:169: error: initializer expression list treated as compound expressi
on
project.cpp:169: error: expected `,' or `;' before '{' token
project.cpp:178: error: `QScriptValue' does not name a type
project.cpp:192: error: `QScriptValue' does not name a type
project.cpp:206: error: `QScriptValue' does not name a type
project.cpp:235: error: `QScriptValue' does not name a type
project.cpp:243: error: `QT_END_NAMESPACE' does not name a type
project.cpp:253: error: expected constructor, destructor, or type conversion bef
ore ';' token
project.cpp:255: error: `QString' does not name a type
project.cpp:271: error: `QString' does not name a type
project.cpp:313: error: `QStringList' does not name a type
project.cpp:368: error: `QStringList' does not name a type
project.cpp:419: error: `QString' does not name a type
project.cpp:420: error: `parser_info' does not name a type
project.cpp:421: error: expected `,' or `...' before '&' token
project.cpp:421: error: ISO C++ forbids declaration of `QString' with no type
project.cpp:423: error: ISO C++ forbids declaration of `QList' with no type
project.cpp:423: error: expected `;' before '<' token
project.cpp:431: error: `QMap' has not been declared
project.cpp:431: error: expected `,' or `...' before '<' token
project.cpp:431: error: ISO C++ forbids declaration of `parameter' with no type
project.cpp: In constructor `ParsableBlock::Parse::Parse(int)':
project.cpp:421: error: class `ParsableBlock::Parse' does not have any field nam
ed `text'
project.cpp:421: error: `t' was not declared in this scope
project.cpp:421: error: `pi' was not declared in this scope
project.cpp:421: error: `parser' was not declared in this scope
project.cpp: At global scope:
project.cpp:434: error: `QMap' has not been declared
project.cpp:434: error: expected `,' or `...' before '<' token
project.cpp:435: error: ISO C++ forbids declaration of `parameter' with no type
project.cpp: In member function `bool ParsableBlock::eval(QMakeProject*, int)':
project.cpp:437: error: `parser_info' was not declared in this scope
project.cpp:437: error: expected `;' before "pi"
project.cpp:438: error: 'class QMakeProject' has no member named 'scope_blocks'
project.cpp:442: error: `parselist' was not declared in this scope
project.cpp:443: error: `parser' was not declared in this scope
project.cpp:444: error: `place' was not declared in this scope
project.cpp:449: error: `parser' was not declared in this scope
project.cpp:449: error: `pi' was not declared in this scope
project.cpp:450: error: 'class QMakeProject' has no member named 'scope_blocks'
project.cpp:451: error: 'class QMakeProject' has no member named 'scope_blocks'
project.cpp: At global scope:
project.cpp:460: error: ISO C++ forbids declaration of `QMap' with no type
project.cpp:460: error: expected `;' before '<' token
project.cpp:461: error: ISO C++ forbids declaration of `QMap' with no type
project.cpp:461: error: expected `;' before '<' token
project.cpp:462: error: `QStringList' does not name a type
project.cpp:466: error: expected `,' or `...' before '<' token
project.cpp:467: error: ISO C++ forbids declaration of `QList' with no type
project.cpp: In constructor `FunctionBlock::FunctionBlock()':
project.cpp:458: error: class `FunctionBlock' does not have any field named `cal
ling_place'
project.cpp: At global scope:
project.cpp:471: error: expected `,' or `...' before '<' token
project.cpp:474: error: ISO C++ forbids declaration of `QList' with no type
project.cpp: In member function `bool FunctionBlock::exec(int)':
project.cpp:477: error: `calling_place' was not declared in this scope
project.cpp:477: error: `place' was not declared in this scope
project.cpp:481: error: `return_value' was not declared in this scope
project.cpp:488: error: `vars' was not declared in this scope
project.cpp:491: error: `args' was not declared in this scope
project.cpp:493: error: `QString' has not been declared
project.cpp:493: error: `number' was not declared in this scope
project.cpp:495: error: `proj' was not declared in this scope
project.cpp:496: error: `functionReturn' was not declared in this scope
project.cpp: At global scope:
project.cpp:513: error: `QString' does not name a type
project.cpp:514: error: `QStringList' does not name a type
project.cpp:516: error: `parser_info' does not name a type
project.cpp:517: error: expected `,' or `...' before '&' token
project.cpp:517: error: ISO C++ forbids declaration of `QString' with no type
project.cpp:519: error: ISO C++ forbids declaration of `QList' with no type
project.cpp:519: error: expected `;' before '<' token
project.cpp:521: error: `QString' does not name a type
project.cpp:524: error: `QStringList' does not name a type
project.cpp:526: error: `QMap' has not been declared
project.cpp:526: error: expected `,' or `...' before '<' token
project.cpp:526: error: ISO C++ forbids declaration of `parameter' with no type
project.cpp: In constructor `IteratorBlock::Test::Test(int)':
project.cpp:517: error: class `IteratorBlock::Test' does not have any field name
d `func'
project.cpp:517: error: `f' was not declared in this scope
project.cpp:517: error: class `IteratorBlock::Test' does not have any field name
d `args'
project.cpp:517: error: `a' was not declared in this scope
project.cpp:517: error: `i' was not declared in this scope
project.cpp:517: error: `pi' was not declared in this scope
project.cpp:517: error: `parser' was not declared in this scope
project.cpp: At global scope:
project.cpp:529: error: `QMap' has not been declared
project.cpp:529: error: expected `,' or `...' before '<' token
project.cpp:530: error: ISO C++ forbids declaration of `parameter' with no type
project.cpp: In member function `bool IteratorBlock::exec(QMakeProject*, int)':
project.cpp:532: error: `QStringList' has not been declared
project.cpp:532: error: `Iterator' was not declared in this scope
project.cpp:532: error: expected `;' before "it"
project.cpp:534: error: `it' was not declared in this scope
project.cpp:534: error: `list' was not declared in this scope
project.cpp:541: error: `it' was not declared in this scope
project.cpp:541: error: `list' was not declared in this scope
project.cpp:549: error: `QStringList' was not declared in this scope
project.cpp:549: error: expected `;' before "va"
project.cpp:550: error: `variable' was not declared in this scope
project.cpp:551: error: `va' was not declared in this scope
project.cpp:551: error: `place' was not declared in this scope
project.cpp:553: error: `QString' has not been declared
project.cpp:553: error: `number' was not declared in this scope
project.cpp:559: error: `QList' was not declared in this scope
project.cpp:559: error: expected primary-expression before '>' token
project.cpp:559: error: `::Iterator' has not been declared
project.cpp:559: error: expected `;' before "test_it"
project.cpp:559: error: `test_it' was not declared in this scope
project.cpp:559: error: `test' was not declared in this scope
project.cpp:560: error: `parser' was not declared in this scope
project.cpp:561: error: `place' was not declared in this scope
project.cpp:568: error: `place' was not declared in this scope
project.cpp:570: error: `variable' was not declared in this scope
project.cpp:571: error: `place' was not declared in this scope
project.cpp:571: error: `va' was not declared in this scope
project.cpp: At global scope:
project.cpp:593: error: expected `,' or `...' before '&' token
project.cpp:594: error: ISO C++ forbids declaration of `QString' with no type
project.cpp: In function `void qmake_error_msg(int)':
project.cpp:595: error: `parser' was not declared in this scope
project.cpp:596: error: `msg' was not declared in this scope
project.cpp: At global scope:
project.cpp:613: error: `QStringList' does not name a type
project.cpp:693: error: `QStringList' does not name a type
project.cpp:710: error: `QStringList' does not name a type
project.cpp:714: error: expected `,' or `...' before '<' token
project.cpp:714: error: ISO C++ forbids declaration of `QMap' with no type
project.cpp:717: error: expected `,' or `...' before '<' token
project.cpp:717: error: ISO C++ forbids declaration of `QMap' with no type
project.cpp: In constructor `QMakeProjectEnv::QMakeProjectEnv(QMakeProject*)':
project.cpp:713: error: 'class QMakeProject' has no member named 'variables'
project.cpp: In constructor `QMakeProjectEnv::QMakeProjectEnv(int)':
project.cpp:714: error: `values' was not declared in this scope
project.cpp: In member function `void QMakeProjectEnv::execute(QMakeProject*)':
project.cpp:716: error: 'class QMakeProject' has no member named 'variables'
project.cpp: In member function `void QMakeProjectEnv::execute(int)':
project.cpp:728: error: `values' was not declared in this scope
project.cpp:728: error: `Q_UNUSED' was not declared in this scope
project.cpp: In destructor `QMakeProject::~QMakeProject()':
project.cpp:743: error: `prop' was not declared in this scope
project.cpp:744: error: `QMap' was not declared in this scope
project.cpp:744: error: `QString' was not declared in this scope
project.cpp:744: error: expected primary-expression before '*' token
project.cpp:744: error: expected primary-expression before '>' token
project.cpp:744: error: `::iterator' has not been declared
project.cpp:744: error: expected `;' before "it"
project.cpp:744: error: `it' was not declared in this scope
project.cpp:744: error: `replaceFunctions' was not declared in this scope
project.cpp:748: error: `replaceFunctions' was not declared in this scope
project.cpp:749: error: expected primary-expression before '*' token
project.cpp:749: error: expected primary-expression before '>' token
project.cpp:749: error: `::iterator' has not been declared
project.cpp:749: error: expected `;' before "it"
project.cpp:749: error: `it' was not declared in this scope
project.cpp:749: error: `testFunctions' was not declared in this scope
project.cpp:753: error: `testFunctions' was not declared in this scope
project.cpp: At global scope:
project.cpp:758: error: expected `,' or `...' before '<' token
project.cpp:759: error: ISO C++ forbids declaration of `QMap' with no type
project.cpp:759: error: prototype for `void QMakeProject::init(QMakeProperty*, i
nt)' does not match any in class `QMakeProject'
project.h:119: error: candidate is: void QMakeProject::init(int*, int)
project.cpp: In member function `void QMakeProject::init(QMakeProperty*, int)':
project.cpp:760: error: `vars' was not declared in this scope
project.cpp:761: error: `base_vars' was not declared in this scope
project.cpp:763: error: `prop' was not declared in this scope
project.cpp:766: error: `prop' was not declared in this scope
project.cpp: At global scope:
project.cpp:772: error: expected `,' or `...' before '<' token
project.cpp:773: error: ISO C++ forbids declaration of `QMap' with no type
project.cpp: In constructor `QMakeProject::QMakeProject(QMakeProject*, int)':
project.cpp:774: error: 'class QMakeProject' has no member named 'properties'
project.cpp:774: error: `vars' was not declared in this scope
project.cpp:774: error: 'class QMakeProject' has no member named 'variables'
project.cpp:775: error: `QString' was not declared in this scope
project.cpp:775: error: expected primary-expression before '*' token
project.cpp:775: error: expected primary-expression before '>' token
project.cpp:775: error: `::iterator' has not been declared
project.cpp:775: error: expected `;' before "it"
project.cpp:775: error: `it' was not declared in this scope
project.cpp:775: error: 'class QMakeProject' has no member named 'replaceFunctio
ns'
project.cpp:777: error: `replaceFunctions' was not declared in this scope
project.cpp:779: error: expected primary-expression before '*' token
project.cpp:779: error: expected primary-expression before '>' token
project.cpp:779: error: `::iterator' has not been declared
project.cpp:779: error: expected `;' before "it"
project.cpp:779: error: `it' was not declared in this scope
project.cpp:779: error: 'class QMakeProject' has no member named 'testFunctions'

project.cpp:781: error: `testFunctions' was not declared in this scope
project.cpp: In member function `void QMakeProject::reset()':
project.cpp:789: error: `scope_blocks' was not declared in this scope
project.cpp: At global scope:
project.cpp:796: error: expected `,' or `...' before '&' token
project.cpp:797: error: ISO C++ forbids declaration of `QString' with no type
project.cpp: In member function `bool QMakeProject::parse(int)':
project.cpp:798: error: expected `;' before "s"
project.cpp:799: error: `s' was not declared in this scope
project.cpp:805: error: `scope_blocks' was not declared in this scope
project.cpp:813: error: `parser' was not declared in this scope
project.cpp:818: error: `place' was not declared in this scope
project.cpp:823: error: `parser' was not declared in this scope
project.cpp:833: error: `parser' was not declared in this scope
project.cpp:839: error: expected `;' before "append"
project.cpp:841: error: expected initializer before '*' token
project.cpp:844: error: `d' was not declared in this scope
project.cpp:844: error: `QLatin1Char' was not declared in this scope
project.cpp:853: error: `append' was not declared in this scope
project.cpp:853: error: `d' was not declared in this scope
project.cpp:856: error: `append' was not declared in this scope
project.cpp:857: error: 'struct FunctionBlock' has no member named 'parselist'
project.cpp:860: error: `d' was not declared in this scope
project.cpp:860: error: `QString' cannot be used as a function
project.cpp:864: error: `scope_blocks' was not declared in this scope
project.cpp:865: error: expected `;' before "append"
project.cpp:867: error: expected initializer before '*' token
project.cpp:870: error: `d' was not declared in this scope
project.cpp:870: error: `QLatin1Char' was not declared in this scope
project.cpp:879: error: `append' was not declared in this scope
project.cpp:879: error: `d' was not declared in this scope
project.cpp:882: error: `append' was not declared in this scope
project.cpp:886: error: `place' was not declared in this scope
project.cpp:896: error: expected `;' before "scope"
project.cpp:897: error: `QStringList' was not declared in this scope
project.cpp:897: error: expected `;' before "val"
project.cpp:899: error: expected initializer before '*' token
project.cpp:901: error: `d' was not declared in this scope
project.cpp:901: error: `QLatin1Char' was not declared in this scope
project.cpp:904: error: `QChar' was not declared in this scope
project.cpp:904: error: expected `;' before "quote"
project.cpp:908: error: `d' was not declared in this scope
project.cpp:908: error: `QLatin1Char' was not declared in this scope
project.cpp:910: error: `d' was not declared in this scope
project.cpp:910: error: `QLatin1Char' was not declared in this scope
project.cpp:915: error: expected initializer before '*' token
project.cpp:917: error: `k' was not declared in this scope
project.cpp:918: error: `k' was not declared in this scope
project.cpp:919: error: expected `;' before "msg"
project.cpp:920: error: `QString' cannot be used as a function
project.cpp:927: error: `quote' was not declared in this scope
project.cpp:928: error: `d' was not declared in this scope
project.cpp:930: error: `d' was not declared in this scope
project.cpp:938: error: `quote' was not declared in this scope
project.cpp:939: error: `d' was not declared in this scope
project.cpp:939: error: `QLatin1Char' was not declared in this scope
project.cpp:942: error: `scope' was not declared in this scope
project.cpp:942: error: `var' was not declared in this scope
project.cpp:951: error: `scope_blocks' was not declared in this scope
project.cpp:956: error: `scope_blocks' was not declared in this scope
project.cpp:957: error: `parser' was not declared in this scope
project.cpp:958: error: `QString' cannot be used as a function
project.cpp:961: error: expected `;' before "comp_scope"
project.cpp:962: error: `comp_scope' was not declared in this scope
project.cpp:973: error: expected `;' before "func"
project.cpp:974: error: expected `;' before "args"
project.cpp:977: error: `parser' was not declared in this scope
project.cpp:979: error: `func' was not declared in this scope
project.cpp:980: error: `args' was not declared in this scope
project.cpp:982: error: `parser' was not declared in this scope
project.cpp:986: error: `parser' was not declared in this scope
project.cpp:991: error: expected `;' before "it_list"
project.cpp:992: error: `args' was not declared in this scope
project.cpp:993: error: `place' was not declared in this scope
project.cpp:994: error: `it_list' was not declared in this scope
project.cpp:999: error: `parser' was not declared in this scope
project.cpp:1004: error: 'struct IteratorBlock' has no member named 'variable'
project.cpp:1005: error: `place' was not declared in this scope
project.cpp:1006: error: `it_list' was not declared in this scope
project.cpp:1008: error: expected `;' before "list"
project.cpp:1009: error: `list' was not declared in this scope
project.cpp:1010: error: `it_list' was not declared in this scope
project.cpp:1022: error: `QString' is not a class or namespace
project.cpp:1022: error: `number' was not declared in this scope
project.cpp:1025: error: `QString' is not a class or namespace
project.cpp:1025: error: `number' was not declared in this scope
project.cpp:1032: error: 'struct IteratorBlock' has no member named 'list'
project.cpp:1032: error: `list' was not declared in this scope
project.cpp:1035: error: 'struct IteratorBlock' has no member named 'test'
project.cpp:1035: error: `args' was not declared in this scope
project.cpp:1038: error: `function_blocks' was not declared in this scope
project.cpp:1041: error: `parser' was not declared in this scope
project.cpp:1044: error: `args' was not declared in this scope
project.cpp:1046: error: `parser' was not declared in this scope
project.cpp:1049: error: `QMap' was not declared in this scope
project.cpp:1049: error: expected primary-expression before '*' token
project.cpp:1049: error: expected primary-expression before '>' token
project.cpp:1049: error: `map' was not declared in this scope
project.cpp:1051: error: `testFunctions' was not declared in this scope
project.cpp:1053: error: `replaceFunctions' was not declared in this scope
project.cpp:1062: error: `args' was not declared in this scope
project.cpp:1065: error: `args' was not declared in this scope
project.cpp:1065: error: `place' was not declared in this scope
project.cpp:1069: error: `scope_blocks' was not declared in this scope
project.cpp:1075: error: expected `;' before "cscope"
project.cpp:1076: error: `cscope' was not declared in this scope
project.cpp:1076: error: `place' was not declared in this scope
project.cpp:1084: error: `parser' was not declared in this scope
project.cpp:1099: error: 'struct IteratorBlock' has no member named 'parselist'
project.cpp:1111: error: `scope_blocks' was not declared in this scope
project.cpp:1112: error: `parser' was not declared in this scope
project.cpp:1115: error: `parser' was not declared in this scope
project.cpp:1118: error: `parser' was not declared in this scope
project.cpp:1122: error: `place' was not declared in this scope
project.cpp:1125: error: `var' was not declared in this scope
project.cpp:1129: error: `var' was not declared in this scope
project.cpp:1132: error: `scope_blocks' was not declared in this scope
project.cpp:1137: error: 'struct QMakeProject::ScopeBlock' has no member named '
else_status'
project.cpp:1139: error: 'struct QMakeProject::ScopeBlock' has no member named '
else_status'
project.cpp:1141: error: 'struct QMakeProject::ScopeBlock' has no member named '
else_status'
project.cpp:1142: error: `scope_blocks' was not declared in this scope
project.cpp:1143: error: `parser' was not declared in this scope
project.cpp:1146: error: 'struct IteratorBlock' has no member named 'parselist'
project.cpp:1147: error: `place' was not declared in this scope
project.cpp:1153: error: `scope_blocks' was not declared in this scope
project.cpp:1160: error: `d' was not declared in this scope
project.cpp:1160: error: `QLatin1Char' was not declared in this scope
project.cpp:1161: error: `op' was not declared in this scope
project.cpp:1161: error: `d' was not declared in this scope
project.cpp:1163: error: `op' was not declared in this scope
project.cpp:1163: error: `QRegExp' was not declared in this scope
project.cpp:1165: error: `d' was not declared in this scope
project.cpp:1165: error: `QLatin1Char' was not declared in this scope
project.cpp:1166: error: expected `;' before "vals"
project.cpp:1167: error: `vals' was not declared in this scope
project.cpp:1168: error: `scope_blocks' was not declared in this scope
project.cpp:1169: error: `parser' was not declared in this scope
project.cpp:1173: error: `place' was not declared in this scope
project.cpp:1177: error: `parser' was not declared in this scope
project.cpp:1183: error: `place' was not declared in this scope
project.cpp:1184: error: `varMap' was not declared in this scope
project.cpp:1186: error: `QString' does not name a type
project.cpp:1187: error: `parser' was not declared in this scope
project.cpp:1187: error: `last_file' was not declared in this scope
project.cpp:1194: error: `numLines' was not declared in this scope
project.cpp:1196: error: `parser' was not declared in this scope
project.cpp:1198: error: `varlist' was not declared in this scope
project.cpp:1201: error: expected `;' before "tmp_vals"
project.cpp:1202: error: `tmp_vals' was not declared in this scope
project.cpp:1203: error: `parser' was not declared in this scope
project.cpp:1215: error: expected `;' before "sep"
project.cpp:1216: error: expected `;' before "func"
project.cpp:1217: error: `func' was not declared in this scope
project.cpp:1223: error: `func' was not declared in this scope
project.cpp:1228: error: expected `;' before "from"
project.cpp:1230: error: `from' was not declared in this scope
project.cpp:1230: error: `QRegExp' is not a class or namespace
project.cpp:1230: error: `escape' was not declared in this scope
project.cpp:1231: error: expected `;' before "regexp"
project.cpp:1232: error: `QStringList' is not a class or namespace
project.cpp:1232: error: `Iterator' was not declared in this scope
project.cpp:1232: error: expected `;' before "varit"
project.cpp:1232: error: `varit' was not declared in this scope
project.cpp:1233: error: `regexp' was not declared in this scope
project.cpp:1234: error: `to' was not declared in this scope
project.cpp:1245: error: expected `;' before "vallist"
project.cpp:1248: error: expected `;' before "tmp"
project.cpp:1249: error: `tmp' was not declared in this scope
project.cpp:1250: error: `vallist' was not declared in this scope
project.cpp:1250: error: `doVariableReplaceExpand' was not declared in this scop
e
project.cpp:1257: error: `QSet' was not declared in this scope
project.cpp:1257: error: `incoming_vals' was not declared in this scope
project.cpp:1257: error: `vallist' was not declared in this scope
project.cpp:1259: error: `QString' does not name a type
project.cpp:1268: error: `parser' was not declared in this scope
project.cpp:1272: error: `QStringList' is not a class or namespace
project.cpp:1272: error: `ConstIterator' was not declared in this scope
project.cpp:1272: error: expected `;' before "valit"
project.cpp:1273: error: `valit' was not declared in this scope
project.cpp:1273: error: `vallist' was not declared in this scope
project.cpp:1283: error: `vallist' was not declared in this scope
project.cpp: At global scope:
project.cpp:1289: error: `bool QMakeProject::read' is not a static member of `cl
ass QMakeProject'
project.cpp:1289: error: `QTextStream' was not declared in this scope
project.cpp:1289: error: `file' was not declared in this scope
project.cpp:1289: error: `QMap' was not declared in this scope
project.cpp:1289: error: `QString' was not declared in this scope
project.cpp:1289: error: `QStringList' was not declared in this scope
project.cpp:1289: error: `place' was not declared in this scope
project.cpp:1290: error: initializer expression list treated as compound express
ion
project.cpp:1290: error: expected `,' or `;' before '{' token
project.cpp:1332: error: expected `,' or `...' before '&' token
project.cpp:1333: error: ISO C++ forbids declaration of `QString' with no type
project.cpp: In member function `bool QMakeProject::read(int)':
project.cpp:1334: error: `parser_info' was not declared in this scope
project.cpp:1334: error: expected `;' before "pi"
project.cpp:1337: error: `QString' does not name a type
project.cpp:1338: error: expected `;' before "filename"
project.cpp:1339: error: `filename' was not declared in this scope
project.cpp:1339: error: `place' was not declared in this scope
project.cpp:1341: error: `QFile' was not declared in this scope
project.cpp:1341: error: expected `;' before "qfile"
project.cpp:1342: error: `strcmp' was not declared in this scope
project.cpp:1343: error: `qfile' was not declared in this scope
project.cpp:1344: error: `QIODevice' has not been declared
project.cpp:1344: error: `ReadOnly' was not declared in this scope
project.cpp:1346: error: `file' was not declared in this scope
project.cpp:1346: error: `QFileInfo' was not declared in this scope
project.cpp:1349: error: `qfile' was not declared in this scope
project.cpp:1350: error: `QIODevice' has not been declared
project.cpp:1350: error: `ReadOnly' was not declared in this scope
project.cpp:1354: error: expected `;' before "pi"
project.cpp:1355: error: `parser' was not declared in this scope
project.cpp:1358: error: `QTextStream' was not declared in this scope
project.cpp:1358: error: expected `;' before "t"
project.cpp:1359: error: `t' was not declared in this scope
project.cpp:1361: error: `qfile' was not declared in this scope
project.cpp:1363: error: `scope_blocks' was not declared in this scope
project.cpp:1364: error: invalid conversion from `const char*' to `int'
project.cpp:1364: error:   initializing argument 1 of `void qmake_error_msg(int)
'
project.cpp:1367: error: `parser' was not declared in this scope
project.cpp:1367: error: `pi' was not declared in this scope
project.cpp:1368: error: `oldpwd' was not declared in this scope
project.cpp: At global scope:
project.cpp:1373: error: expected `,' or `...' before '&' token
project.cpp:1374: error: ISO C++ forbids declaration of `QString' with no type
project.cpp:1374: error: redefinition of `bool QMakeProject::read(int)'
project.cpp:1333: error: `bool QMakeProject::read(int)' previously defined here
project.cpp: In member function `bool QMakeProject::read(int)':
project.cpp:1375: error: `pfile' was not declared in this scope
project.cpp:1375: error: `project' was not declared in this scope
project.cpp:1375: error: `QFileInfo' was not declared in this scope
project.cpp:1376: error: `cmd' was not declared in this scope
project.cpp: At global scope:
project.cpp:1380: error: `bool QMakeProject::read' is not a static member of `cl
ass QMakeProject'
project.cpp:1380: error: `uchar' was not declared in this scope
project.cpp:1381: error: expected `,' or `;' before '{' token
project.cpp:1609: error: expected `,' or `...' before '&' token
project.cpp:1610: error: ISO C++ forbids declaration of `QString' with no type
project.cpp: In member function `bool QMakeProject::isActiveConfig(int)':
project.cpp:1611: error: `x' was not declared in this scope
project.cpp:1615: error: `x' was not declared in this scope
project.cpp:1622: error: `x' was not declared in this scope
project.cpp:1635: error: `QRegExp' was not declared in this scope
project.cpp:1635: error: expected `;' before "re"
project.cpp:1636: error: `QString' does not name a type
project.cpp:1637: error: `spec' was not declared in this scope
project.cpp:1638: error: `qmakespec' is not a member of `Option::mkfile'
project.cpp:1638: error: `QFileInfo' was not declared in this scope
project.cpp:1639: error: `regex' was not declared in this scope
project.cpp:1639: error: `re' was not declared in this scope
project.cpp:1639: error: `spec' was not declared in this scope
project.cpp:1639: error: `x' was not declared in this scope
project.cpp:1676: error: expected initializer before '&' token
project.cpp:1677: error: `QStringList' has not been declared
project.cpp:1677: error: `ConstIterator' was not declared in this scope
project.cpp:1677: error: expected `;' before "it"
project.cpp:1677: error: `it' was not declared in this scope
project.cpp:1677: error: `configs' was not declared in this scope
project.cpp:1678: error: `regex' was not declared in this scope
project.cpp:1678: error: `re' was not declared in this scope
project.cpp:1678: error: `x' was not declared in this scope
project.cpp: At global scope:
project.cpp:1685: error: `bool QMakeProject::doProjectTest' is not a static memb
er of `class QMakeProject'
project.cpp:1685: error: `QString' was not declared in this scope
project.cpp:1685: error: `QMap' was not declared in this scope
project.cpp:1685: error: `QString' was not declared in this scope
project.cpp:1685: error: `QStringList' was not declared in this scope
project.cpp:1685: error: `place' was not declared in this scope
project.cpp:1686: error: initializer expression list treated as compound express
ion
project.cpp:1686: error: expected `,' or `;' before '{' token
project.cpp:1713: error: `bool QMakeProject::doProjectTest' is not a static memb
er of `class QMakeProject'
project.cpp:1713: error: `QString' was not declared in this scope
project.cpp:1713: error: expected primary-expression before "const"
project.cpp:1714: error: `QMap' was not declared in this scope
project.cpp:1714: error: `QString' was not declared in this scope
project.cpp:1714: error: `QStringList' was not declared in this scope
project.cpp:1714: error: `place' was not declared in this scope
project.cpp:1715: error: initializer expression list treated as compound express
ion
project.cpp:1715: error: expected `,' or `;' before '{' token
project.cpp:1720: error: `QMakeProject::IncludeStatus QMakeProject::doProjectInc
lude' is not a static member of `class QMakeProject'
project.cpp:1720: error: `QString' was not declared in this scope
project.cpp:1720: error: `uchar' was not declared in this scope
project.cpp:1720: error: `QMap' was not declared in this scope
project.cpp:1720: error: `QString' was not declared in this scope
project.cpp:1720: error: `QStringList' was not declared in this scope
project.cpp:1720: error: `place' was not declared in this scope
project.cpp:1721: error: initializer expression list treated as compound express
ion
project.cpp:1721: error: expected `,' or `;' before '{' token
project.cpp:1874: error: `QStringList' does not name a type
project.cpp:1881: error: `QStringList' does not name a type
project.cpp:1895: error: `QStringList' does not name a type
project.cpp:2343: error: `bool QMakeProject::doProjectTest' is not a static memb
er of `class QMakeProject'
project.cpp:2343: error: `QString' was not declared in this scope
project.cpp:2343: error: `QStringList' was not declared in this scope
project.cpp:2343: error: `QMap' was not declared in this scope
project.cpp:2343: error: `QString' was not declared in this scope
project.cpp:2343: error: `QStringList' was not declared in this scope
project.cpp:2343: error: `place' was not declared in this scope
project.cpp:2344: error: initializer expression list treated as compound express
ion
project.cpp:2344: error: expected `,' or `;' before '{' token
project.cpp:2356: error: `bool QMakeProject::doProjectTest' is not a static memb
er of `class QMakeProject'
project.cpp:2356: error: `QString' was not declared in this scope
project.cpp:2356: error: `QList' was not declared in this scope
project.cpp:2356: error: `QStringList' was not declared in this scope
project.cpp:2356: error: `args_list' was not declared in this scope
project.cpp:2356: error: `QMap' was not declared in this scope
project.cpp:2356: error: `QString' was not declared in this scope
project.cpp:2356: error: `QStringList' was not declared in this scope
project.cpp:2356: error: `place' was not declared in this scope
project.cpp:2357: error: initializer expression list treated as compound express
ion
project.cpp:2357: error: expected `,' or `;' before '{' token
project.cpp:2818: error: expected `,' or `...' before '&' token
project.cpp:2819: error: ISO C++ forbids declaration of `QStringList' with no ty
pe
project.cpp: In member function `bool QMakeProject::doProjectCheckReqs(int)':
project.cpp:2821: error: `QStringList' is not a class or namespace
project.cpp:2821: error: `ConstIterator' was not declared in this scope
project.cpp:2821: error: expected `;' before "it"
project.cpp:2821: error: `it' was not declared in this scope
project.cpp:2821: error: `deps' was not declared in this scope
project.cpp:2822: error: `place' was not declared in this scope
project.cpp:2825: error: `parser' was not declared in this scope
project.cpp: At global scope:
project.cpp:2835: error: expected `,' or `...' before '&' token
project.cpp:2836: error: ISO C++ forbids declaration of `QString' with no type
project.cpp: In member function `bool QMakeProject::test(int)':
project.cpp:2837: error: `QMap' was not declared in this scope
project.cpp:2837: error: `QStringList' was not declared in this scope
project.cpp:2837: error: `tmp' was not declared in this scope
project.cpp:2837: error: `vars' was not declared in this scope
project.cpp:2838: error: `v' was not declared in this scope
project.cpp: At global scope:
project.cpp:2842: error: expected `,' or `...' before '&' token
project.cpp:2843: error: ISO C++ forbids declaration of `QString' with no type
project.cpp:2843: error: redefinition of `bool QMakeProject::test(int)'
project.cpp:2836: error: `bool QMakeProject::test(int)' previously defined here
project.cpp:2843: confused by earlier errors, bailing out
mingw32-make: *** [project.o] Error 1
del project.o main.o makefile.o unixmake.o unixmake2.o mingw_make.o option.o win
makefile.o projectgenerator.o property.o meta.o makefiledeps.o metamakefile.o xm
loutput.o pbuilder_pbx.o borland_bmake.o msvc_nmake.o msvc_dsp.o msvc_vcproj.o m
svc_objectmodel.o qbitarray.o qbuffer.o qbytearray.o qcryptographichash.o qvsnpr
intf.o qbytearraymatcher.o qconfig.o qdatetime.o qdir.o qdiriterator.o qfile.o q
temporaryfile.o qfileinfo.o qabstractfileengine.o qfsfileengine.o qfsfileengine_
iterator.o qfsfileengine_win.o qfsfileengine_iterator_win.o qglobal.o qhash.o qi
odevice.o qlibraryinfo.o qlistdata.o qlinkedlist.o qlocale.o qmalloc.o qmap.o qr
egexp.o qstring.o qstringlist.o qtextstream.o quuid.o qvector.o qurl.o qsettings
.o qsettings_win.o qvariant.o qmetatype.o qnumeric.o qscriptasm.o qscriptast.o q
scriptastvisitor.o qscriptcompiler.o qscriptecmaarray.o qscriptecmaboolean.o qsc
riptecmacore.o qscriptecmadate.o qscriptecmafunction.o qscriptecmaglobal.o qscri
ptecmamath.o qscriptecmanumber.o qscriptecmaobject.o qscriptecmaregexp.o qscript
ecmastring.o qscriptecmaerror.o qscriptcontext_p.o qscriptengine.o qscriptengine
_p.o qscriptengineagent.o qscriptextenumeration.o qscriptextvariant.o qscriptcon
text.o qscriptcontextinfo.o qscriptfunction.o qscriptgrammar.o qscriptlexer.o qs
criptclassdata.o qscriptparser.o qscriptprettypretty.o qscriptsyntaxchecker.o qs
criptclass.o qscriptclasspropertyiterator.o qscriptstring.o qscriptvalue.o qscri
ptvalueimpl.o qscriptvalueiterator.o qscriptvalueiteratorimpl.o
mingw32-make: del: Command not found
mingw32-make: [clean] Error 127 (ignored)
g++ -c -oproject.o -O -I. -Igenerators -Igenerators/unix -Igenerators/win32 -Ige
nerators/mac -IC:\kderoot\tmp\qt-4.4.0.20080222\work\qt-win-opensource-src-mingw
/include -IC:\kderoot\tmp\qt-4.4.0.20080222\work\qt-win-opensource-src-mingw/inc
lude/QtCore -IC:\kderoot\tmp\qt-4.4.0.20080222\work\qt-win-opensource-src-mingw/
include -IC:\kderoot\tmp\qt-4.4.0.20080222\work\qt-win-opensource-src-mingw/incl
ude/QtCore -IC:\kderoot\tmp\qt-4.4.0.20080222\work\qt-win-opensource-src-mingw/s
rc/corelib/global -IC:\kderoot\tmp\qt-4.4.0.20080222\work\qt-win-opensource-src-
mingw/include/QtScript -IC:\kderoot\tmp\qt-4.4.0.20080222\work\qt-win-opensource
-src-mingw/mkspecs/win32-g++ -DQT_NO_TEXTCODEC -DQT_NO_UNICODETABLES -DQT_LITE_C
OMPONENT -DQT_NO_PCRE -DQT_NODLL -DQT_NO_STL -DQT_NO_COMPRESS -DUNICODE -DHAVE_Q
CONFIG_CPP -DQT_BUILD_QMAKE -DQT_NO_THREAD -DQT_NO_QOBJECT -DQT_NO_GEOM_VARIANT
-DQT_NO_DATASTREAM -DQMAKE_OPENSOURCE_EDITION project.cpp
In file included from project.cpp:44:
project.h:47:25: qstringlist.h: No such file or directory
project.h:48:25: qtextstream.h: No such file or directory
project.h:49:21: qstring.h: No such file or directory
project.h:50:20: qstack.h: No such file or directory
project.h:51:18: qmap.h: No such file or directory
project.h:52:23: qmetatype.h: No such file or directory
project.h:59:28: qscriptengine.h: No such file or directory
In file included from project.cpp:44:
project.h:64: error: expected constructor, destructor, or type conversion before
 "class"
project.h:79: error: `uint' does not name a type
project.h:86: error: `QScriptEngine' does not name a type
project.h:88: error: ISO C++ forbids declaration of `QStack' with no type
project.h:88: error: expected `;' before '<' token
project.h:89: error: ISO C++ forbids declaration of `QStack' with no type
project.h:89: error: expected `;' before '<' token
project.h:92: error: ISO C++ forbids declaration of `QMap' with no type
project.h:92: error: expected `;' before '<' token
project.h:95: error: `QString' does not name a type
project.h:96: error: ISO C++ forbids declaration of `QMakeProperty' with no type

project.h:96: error: expected `;' before '*' token
project.h:98: error: ISO C++ forbids declaration of `QMap' with no type
project.h:98: error: expected `;' before '<' token
project.h:99: error: expected `,' or `...' before '&' token
project.h:99: error: ISO C++ forbids declaration of `QString' with no type
project.h:114: error: `QString' has not been declared
project.h:114: error: `uchar' has not been declared
project.h:114: error: `QMap' has not been declared
project.h:114: error: expected `,' or `...' before '<' token
project.h:114: error: ISO C++ forbids declaration of `file' with no type
project.h:114: error: ISO C++ forbids declaration of `flags' with no type
project.h:114: error: ISO C++ forbids declaration of `parameter' with no type
project.h:116: error: expected `,' or `...' before '&' token
project.h:116: error: ISO C++ forbids declaration of `QStringList' with no type
project.h:117: error: `QString' has not been declared
project.h:117: error: `QMap' has not been declared
project.h:117: error: expected `,' or `...' before '<' token
project.h:117: error: ISO C++ forbids declaration of `str' with no type
project.h:117: error: ISO C++ forbids declaration of `parameter' with no type
project.h:118: error: `QStringList' does not name a type
project.h:119: error: `QMakeProperty' has not been declared
project.h:119: error: expected `,' or `...' before '<' token
project.h:119: error: ISO C++ forbids declaration of `parameter' with no type
project.h:119: error: ISO C++ forbids declaration of `QMap' with no type
project.h:120: error: ISO C++ forbids declaration of `QStringList' with no type
project.h:120: error: expected `;' before '&' token
project.h:124: error: expected `)' before '*' token
project.h:125: error: expected `,' or `...' before '<' token
project.h:125: error: ISO C++ forbids declaration of `QMap' with no type
project.h:126: error: expected `,' or `...' before '<' token
project.h:126: error: ISO C++ forbids declaration of `QMap' with no type
project.h:127: error: expected `)' before '*' token
project.h:132: error: expected `,' or `...' before '&' token
project.h:132: error: ISO C++ forbids declaration of `QString' with no type
project.h:132: error: `bool QMakeProject::parse(int)' and `bool QMakeProject::pa
rse(int)' cannot be overloaded
project.h:133: error: expected `,' or `...' before '&' token
project.h:133: error: ISO C++ forbids declaration of `QString' with no type
project.h:134: error: `uchar' has not been declared
project.h:134: error: ISO C++ forbids declaration of `cmd' with no type
project.h:134: error: `bool QMakeProject::read(int)' and `bool QMakeProject::rea
d(int)' cannot be overloaded
project.h:136: error: `QStringList' does not name a type
project.h:137: error: `QStringList' does not name a type
project.h:139: error: `QString' does not name a type
project.h:140: error: `QString' does not name a type
project.h:141: error: ISO C++ forbids declaration of `QMakeProperty' with no typ
e
project.h:141: error: `QMakeProperty' declared as an `inline' field
project.h:141: error: expected `;' before '*' token
project.h:143: error: expected `;' before "bool"
project.h:143: error: `QString' has not been declared
project.h:143: error: `QMap' has not been declared
project.h:143: error: expected `,' or `...' before '<' token
project.h:143: error: ISO C++ forbids declaration of `str' with no type
project.h:143: error: ISO C++ forbids declaration of `parameter' with no type
project.h:144: error: `QString' has not been declared
project.h:144: error: expected `,' or `...' before '&' token
project.h:145: error: ISO C++ forbids declaration of `func' with no type
project.h:145: error: ISO C++ forbids declaration of `QString' with no type
project.h:145: error: `bool QMakeProject::doProjectTest(int, int)' and `bool QMa
keProject::doProjectTest(int, int)' cannot be overloaded
project.h:146: error: `QString' has not been declared
project.h:146: error: `QStringList' has not been declared
project.h:147: error: `QMap' has not been declared
project.h:147: error: expected `,' or `...' before '<' token
project.h:147: error: ISO C++ forbids declaration of `func' with no type
project.h:147: error: ISO C++ forbids declaration of `args' with no type
project.h:147: error: ISO C++ forbids declaration of `parameter' with no type
project.h:148: error: `QString' has not been declared
project.h:148: error: `QList' has not been declared
project.h:148: error: expected `,' or `...' before '<' token
project.h:149: error: ISO C++ forbids declaration of `func' with no type
project.h:149: error: ISO C++ forbids declaration of `parameter' with no type
project.h:149: error: `bool QMakeProject::doProjectTest(int, int)' and `bool QMa
keProject::doProjectTest(int, int)' cannot be overloaded
project.h:150: error: `QStringList' does not name a type
project.h:152: error: `QStringList' does not name a type
project.h:154: error: `QStringList' does not name a type
project.h:157: error: `QStringList' does not name a type
project.h:158: error: `QStringList' does not name a type
project.h:159: error: expected `,' or `...' before '&' token
project.h:159: error: ISO C++ forbids declaration of `QString' with no type
project.h:160: error: expected `,' or `...' before '&' token
project.h:160: error: ISO C++ forbids declaration of `QString' with no type
project.h:160: error: `bool QMakeProject::test(int)' and `bool QMakeProject::tes
t(int)' cannot be overloaded
project.h:161: error: expected `,' or `...' before '&' token
project.h:162: error: ISO C++ forbids declaration of `QString' with no type
project.h:164: error: expected `,' or `...' before '&' token
project.h:164: error: ISO C++ forbids declaration of `QString' with no type
project.h:165: error: expected `,' or `...' before '&' token
project.h:165: error: ISO C++ forbids declaration of `QString' with no type
project.h:166: error: ISO C++ forbids declaration of `QStringList' with no type
project.h:166: error: expected `;' before '&' token
project.h:167: error: `QString' does not name a type
project.h:168: error: ISO C++ forbids declaration of `QMap' with no type
project.h:168: error: expected `;' before '<' token
project.h:172: error: expected `,' or `...' before '&' token
project.h:172: error: ISO C++ forbids declaration of `QString' with no type
project.h:172: error: `bool QMakeProject::read(int)' and `bool QMakeProject::rea
d(int)' cannot be overloaded
project.h:173: error: `QTextStream' has not been declared
project.h:173: error: `QMap' has not been declared
project.h:173: error: expected `,' or `...' before '<' token
project.h:173: error: ISO C++ forbids declaration of `file' with no type
project.h:173: error: ISO C++ forbids declaration of `parameter' with no type
project.h: In constructor `QMakeProject::ScopeBlock::ScopeBlock()':
project.h:75: error: class `QMakeProject::ScopeBlock' does not have any field na
med `ignore'
project.h:75: error: class `QMakeProject::ScopeBlock' does not have any field na
med `else_status'
project.h: In constructor `QMakeProject::ScopeBlock::ScopeBlock(bool)':
project.h:76: error: class `QMakeProject::ScopeBlock' does not have any field na
med `ignore'
project.h:76: error: class `QMakeProject::ScopeBlock' does not have any field na
med `else_status'
project.h: In constructor `QMakeProject::QMakeProject(int)':
project.h:126: error: `nvars' was not declared in this scope
project.h: In member function `bool QMakeProject::parse(int)':
project.h:132: error: `text' was not declared in this scope
project.h:132: error: `vars' was not declared in this scope
project.h: At global scope:
project.h:178: error: expected constructor, destructor, or type conversion befor
e "inline"
project.h:185: error: `QString' does not name a type
project.h:188: error: expected initializer before '&' token
project.h:191: error: expected `,' or `...' before '&' token
project.h:192: error: ISO C++ forbids declaration of `QString' with no type
project.h: In member function `bool QMakeProject::isEmpty(int)':
project.h:192: error: `v' was not declared in this scope
project.h:192: error: `values' was not declared in this scope
project.h: At global scope:
project.h:194: error: expected `,' or `...' before '&' token
project.h:195: error: ISO C++ forbids declaration of `QString' with no type
project.h: In member function `bool QMakeProject::isSet(int)':
project.h:195: error: `vars' was not declared in this scope
project.h:195: error: `v' was not declared in this scope
project.h: At global scope:
project.h:197: error: `QString' does not name a type
project.h:205: error: expected initializer before '<' token
In file included from project.cpp:45:
property.h:47:21: qglobal.h: No such file or directory
In file included from project.cpp:45:
project.h:208: error: `QT_END_NAMESPACE' does not name a type
property.h:56: error: ISO C++ forbids declaration of `QSettings' with no type
property.h:56: error: expected `;' before '*' token
property.h:58: error: `QString' does not name a type
property.h:59: error: `QString' does not name a type
property.h:64: error: `QString' has not been declared
property.h:64: error: ISO C++ forbids declaration of `parameter' with no type
property.h:65: error: `QString' does not name a type
property.h:66: error: `QString' has not been declared
property.h:66: error: expected `,' or `...' before '&' token
property.h:66: error: ISO C++ forbids declaration of `parameter' with no type
property.h:66: error: ISO C++ forbids declaration of `QString' with no type
In file included from project.cpp:46:
option.h:50:19: qfile.h: No such file or directory
In file included from project.cpp:46:
property.h:71: error: `QT_END_NAMESPACE' does not name a type
option.h:59: error: `QString' does not name a type
option.h:60: error: expected `,' or `...' before '&' token
option.h:60: error: ISO C++ forbids declaration of `QString' with no type
option.h:75: error: `QString' does not name a type
option.h:76: error: `QString' does not name a type
option.h:77: error: `QString' does not name a type
option.h:78: error: `QString' does not name a type
option.h:79: error: `QString' does not name a type
option.h:80: error: `QString' does not name a type
option.h:81: error: `QStringList' does not name a type
option.h:82: error: `QStringList' does not name a type
option.h:83: error: `QStringList' does not name a type
option.h:84: error: `QString' does not name a type
option.h:85: error: `QString' does not name a type
option.h:86: error: `QString' does not name a type
option.h:87: error: `QString' does not name a type
option.h:88: error: `QString' does not name a type
option.h:89: error: `QString' does not name a type
option.h:90: error: `QString' does not name a type
option.h:91: error: `QString' does not name a type
option.h:92: error: `QString' does not name a type
option.h:93: error: `QString' does not name a type
option.h:94: error: `QString' does not name a type
option.h:95: error: `QString' does not name a type
option.h:96: error: `QString' does not name a type
option.h:97: error: `QString' does not name a type
option.h:119: error: `QString' does not name a type
option.h:122: error: `QString' does not name a type
option.h:131: error: `QString' does not name a type
option.h:147: error: `QString' does not name a type
option.h:148: error: `QFile' does not name a type
option.h:149: error: `QString' does not name a type
option.h:153: error: `QStringList' does not name a type
option.h:156: error: `QString' does not name a type
option.h:157: error: `QStringList' does not name a type
option.h:161: error: `QStringList' does not name a type
option.h:167: error: `QStringList' does not name a type
option.h:172: error: `QString' does not name a type
option.h:179: error: `QString' does not name a type
option.h:181: error: `QStringList' does not name a type
option.h:182: error: `QString' does not name a type
option.h:189: error: `QString' does not name a type
option.h:190: error: `QStringList' does not name a type
option.h:211: error: `QString' does not name a type
In file included from project.cpp:47:
cachekeys.h:51:23: qfileinfo.h: No such file or directory
cachekeys.h:52:19: qhash.h: No such file or directory
In file included from project.cpp:47:
option.h:214: error: `QT_END_NAMESPACE' does not name a type
cachekeys.h:82: error: `uint' does not name a type
cachekeys.h:87: error: `uint' does not name a type
cachekeys.h:88: error: `QString' does not name a type
cachekeys.h:89: error: expected `,' or `...' before '&' token
cachekeys.h:90: error: ISO C++ forbids declaration of `QString' with no type
cachekeys.h:101: error: `uint' does not name a type
cachekeys.h:106: error: expected `,' or `...' before '&' token
cachekeys.h:106: error: ISO C++ forbids declaration of `QString' with no type
cachekeys.h: In constructor `FileInfoCacheKey::FileInfoCacheKey(int)':
cachekeys.h:91: error: `hash' was not declared in this scope
cachekeys.h:92: error: `f' was not declared in this scope
cachekeys.h:93: error: `pwd' was not declared in this scope
cachekeys.h:93: error: `qmake_getpwd' was not declared in this scope
cachekeys.h:94: error: `file' was not declared in this scope
cachekeys.h:94: error: `f' was not declared in this scope
cachekeys.h: In member function `bool FileInfoCacheKey::operator==(const FileInf
oCacheKey&) const':
cachekeys.h:98: error: `hashCode' was not declared in this scope
cachekeys.h:98: error: 'const struct FileInfoCacheKey' has no member named 'hash
Code'
cachekeys.h:98: error: 'const struct FileInfoCacheKey' has no member named 'file
'
cachekeys.h:98: error: `file' was not declared in this scope
cachekeys.h:99: error: 'const struct FileInfoCacheKey' has no member named 'pwd'

cachekeys.h:99: error: `pwd' was not declared in this scope
cachekeys.h: In member function `bool FileInfoCacheKey::isRelativePath(int)':
cachekeys.h:107: error: `file' was not declared in this scope
cachekeys.h:111: error: `QChar' does not name a type
cachekeys.h:112: error: `QChar' does not name a type
cachekeys.h:113: error: `c0' was not declared in this scope
cachekeys.h:113: error: `QLatin1Char' was not declared in this scope
cachekeys.h:115: error: `c1' was not declared in this scope
cachekeys.h: At global scope:
cachekeys.h:120: error: `uint' does not name a type
cachekeys.h:125: error: `uint' does not name a type
cachekeys.h:126: error: `QString' does not name a type
cachekeys.h:127: error: `QString' does not name a type
cachekeys.h:128: error: `uint' does not name a type
cachekeys.h:130: error: expected `,' or `...' before '&' token
cachekeys.h:132: error: ISO C++ forbids declaration of `QString' with no type
cachekeys.h:147: error: `QString' does not name a type
cachekeys.h:160: error: `uint' does not name a type
cachekeys.h: In constructor `FileFixifyCacheKey::FileFixifyCacheKey(int)':
cachekeys.h:133: error: `hash' was not declared in this scope
cachekeys.h:134: error: `pwd' was not declared in this scope
cachekeys.h:134: error: `qmake_getpwd' was not declared in this scope
cachekeys.h:135: error: `file' was not declared in this scope
cachekeys.h:135: error: `f' was not declared in this scope
cachekeys.h:136: error: `od' was not declared in this scope
cachekeys.h:137: error: `out_d' was not declared in this scope
cachekeys.h:137: error: `output_dir' is not a member of `Option'
cachekeys.h:139: error: `out_d' was not declared in this scope
cachekeys.h:140: error: `id' was not declared in this scope
cachekeys.h:141: error: `in_d' was not declared in this scope
cachekeys.h:143: error: `in_d' was not declared in this scope
cachekeys.h:144: error: `fixType' was not declared in this scope
cachekeys.h:144: error: `ft' was not declared in this scope
cachekeys.h:145: error: `c' was not declared in this scope
cachekeys.h: In member function `bool FileFixifyCacheKey::operator==(const FileF
ixifyCacheKey&) const':
cachekeys.h:154: error: 'const struct FileFixifyCacheKey' has no member named 'f
ixType'
cachekeys.h:154: error: `fixType' was not declared in this scope
cachekeys.h:155: error: 'const struct FileFixifyCacheKey' has no member named 'f
ile'
cachekeys.h:155: error: `file' was not declared in this scope
cachekeys.h:156: error: 'const struct FileFixifyCacheKey' has no member named 'i
n_d'
cachekeys.h:156: error: `in_d' was not declared in this scope
cachekeys.h:157: error: 'const struct FileFixifyCacheKey' has no member named 'o
ut_d'
cachekeys.h:157: error: `out_d' was not declared in this scope
cachekeys.h:158: error: 'const struct FileFixifyCacheKey' has no member named 'p
wd'
cachekeys.h:158: error: `pwd' was not declared in this scope
cachekeys.h: At global scope:
cachekeys.h:168: error: `uint' does not name a type
cachekeys.h: In function `void qmakeDeleteCacheClear_QMapStringInt(void*)':
cachekeys.h:172: error: `QMap' has not been declared
cachekeys.h:172: error: expected `>' before '<' token
cachekeys.h:172: error: expected `(' before '<' token
cachekeys.h:172: error: expected primary-expression before '<' token
cachekeys.h:172: error: `QString' was not declared in this scope
cachekeys.h:172: error: expected primary-expression before "int"
cachekeys.h:172: error: expected `)' before "int"
cachekeys.h:172: error: expected `;' before "int"
cachekeys.h: In function `void qmakeDeleteCacheClear_QStringList(void*)':
cachekeys.h:173: error: `QStringList' has not been declared
cachekeys.h:173: error: expected `>' before '*' token
cachekeys.h:173: error: expected `(' before '*' token
cachekeys.h:173: error: expected primary-expression before '>' token
cachekeys.h:173: error: expected `)' before ';' token
cachekeys.h: In function `void qmakeDeleteCacheClear_QHashFixStringCacheKeyQStri
ng(void*)':
cachekeys.h:174: error: `QHash' has not been declared
cachekeys.h:174: error: expected `>' before '<' token
cachekeys.h:174: error: expected `(' before '<' token
cachekeys.h:174: error: expected primary-expression before '<' token
cachekeys.h:174: error: `FixStringCacheKey' was not declared in this scope
cachekeys.h:174: error: `QString' was not declared in this scope
cachekeys.h:174: error: expected primary-expression before '>' token
cachekeys.h:174: error: expected `)' before ';' token
cachekeys.h: In function `void qmakeDeleteCacheClear_QHashFileInfoCacheKeyQFileI
nfo(void*)':
cachekeys.h:175: error: `QHash' has not been declared
cachekeys.h:175: error: expected `>' before '<' token
cachekeys.h:175: error: expected `(' before '<' token
cachekeys.h:175: error: expected primary-expression before '<' token
cachekeys.h:175: error: expected primary-expression before ',' token
cachekeys.h:175: error: `QFileInfo' was not declared in this scope
cachekeys.h:175: error: expected primary-expression before '>' token
cachekeys.h:175: error: expected `)' before ';' token
cachekeys.h: In function `void qmakeDeleteCacheClear_QHashFileFixifyCacheKeyQStr
ing(void*)':
cachekeys.h:176: error: `QHash' has not been declared
cachekeys.h:176: error: expected `>' before '<' token
cachekeys.h:176: error: expected `(' before '<' token
cachekeys.h:176: error: expected primary-expression before '<' token
cachekeys.h:176: error: expected primary-expression before ',' token
cachekeys.h:176: error: `QString' was not declared in this scope
cachekeys.h:176: error: expected primary-expression before '>' token
cachekeys.h:176: error: expected `)' before ';' token
cachekeys.h: In function `void qmakeFreeCacheClear(void*)':
cachekeys.h:177: error: `free' was not declared in this scope
project.cpp:49:23: qdatetime.h: No such file or directory
project.cpp:52:18: qdir.h: No such file or directory
project.cpp:53:21: qregexp.h: No such file or directory
project.cpp:57:20: qdebug.h: No such file or directory
In file included from c:/Arquivos de programas/CodeBlocks/MinGW/bin/../lib/gcc/m
ingw32/3.4.5/../../../../include/stdio.h:26,
                 from project.cpp:64:
c:/Arquivos de programas/CodeBlocks/MinGW/bin/../lib/gcc/mingw32/3.4.5/include/s
tddef.h: At global scope:
c:/Arquivos de programas/CodeBlocks/MinGW/bin/../lib/gcc/mingw32/3.4.5/include/s
tddef.h:213: error: expected constructor, destructor, or type conversion before
"typedef"
In file included from project.cpp:64:
c:/Arquivos de programas/CodeBlocks/MinGW/bin/../lib/gcc/mingw32/3.4.5/../../../
../include/stdio.h:191: error: `size_t' has not been declared
c:/Arquivos de programas/CodeBlocks/MinGW/bin/../lib/gcc/mingw32/3.4.5/../../../
../include/stdio.h:202: error: `size_t' has not been declared
c:/Arquivos de programas/CodeBlocks/MinGW/bin/../lib/gcc/mingw32/3.4.5/../../../
../include/stdio.h:206: error: `size_t' has not been declared
c:/Arquivos de programas/CodeBlocks/MinGW/bin/../lib/gcc/mingw32/3.4.5/../../../
../include/stdio.h:216: error: `size_t' has not been declared
c:/Arquivos de programas/CodeBlocks/MinGW/bin/../lib/gcc/mingw32/3.4.5/../../../
../include/stdio.h:217: error: `size_t' has not been declared
c:/Arquivos de programas/CodeBlocks/MinGW/bin/../lib/gcc/mingw32/3.4.5/../../../
../include/stdio.h:297: error: expected constructor, destructor, or type convers
ion before "fread"
c:/Arquivos de programas/CodeBlocks/MinGW/bin/../lib/gcc/mingw32/3.4.5/../../../
../include/stdio.h:298: error: expected constructor, destructor, or type convers
ion before "fwrite"
In file included from project.cpp:64:
c:/Arquivos de programas/CodeBlocks/MinGW/bin/../lib/gcc/mingw32/3.4.5/../../../
../include/stdio.h:446: error: `size_t' has not been declared
c:/Arquivos de programas/CodeBlocks/MinGW/bin/../lib/gcc/mingw32/3.4.5/../../../
../include/stdio.h:450: error: `size_t' has not been declared
c:/Arquivos de programas/CodeBlocks/MinGW/bin/../lib/gcc/mingw32/3.4.5/../../../
../include/stdio.h:480: error: `size_t' has not been declared
c:/Arquivos de programas/CodeBlocks/MinGW/bin/../lib/gcc/mingw32/3.4.5/../../../
../include/stdio.h:482: error: `size_t' has not been declared
In file included from project.cpp:65:
c:/Arquivos de programas/CodeBlocks/MinGW/bin/../lib/gcc/mingw32/3.4.5/../../../
../include/stdlib.h:335: error: `size_t' has not been declared
c:/Arquivos de programas/CodeBlocks/MinGW/bin/../lib/gcc/mingw32/3.4.5/../../../
../include/stdlib.h:340: error: expected constructor, destructor, or type conver
sion before "wcstombs"
c:/Arquivos de programas/CodeBlocks/MinGW/bin/../lib/gcc/mingw32/3.4.5/../../../
../include/stdlib.h:343: error: `size_t' has not been declared
c:/Arquivos de programas/CodeBlocks/MinGW/bin/../lib/gcc/mingw32/3.4.5/../../../
../include/stdlib.h:344: error: expected constructor, destructor, or type conver
sion before "mbstowcs"
c:/Arquivos de programas/CodeBlocks/MinGW/bin/../lib/gcc/mingw32/3.4.5/../../../
../include/stdlib.h:345: error: `size_t' has not been declared
c:/Arquivos de programas/CodeBlocks/MinGW/bin/../lib/gcc/mingw32/3.4.5/../../../
../include/stdlib.h:350: error: `size_t' was not declared in this scope
c:/Arquivos de programas/CodeBlocks/MinGW/bin/../lib/gcc/mingw32/3.4.5/../../../
../include/stdlib.h:350: error: `size_t' was not declared in this scope
c:/Arquivos de programas/CodeBlocks/MinGW/bin/../lib/gcc/mingw32/3.4.5/../../../
../include/stdlib.h:350: error: initializer expression list treated as compound
expression
c:/Arquivos de programas/CodeBlocks/MinGW/bin/../lib/gcc/mingw32/3.4.5/../../../
../include/stdlib.h:351: error: `size_t' was not declared in this scope
c:/Arquivos de programas/CodeBlocks/MinGW/bin/../lib/gcc/mingw32/3.4.5/../../../
../include/stdlib.h:352: error: `size_t' has not been declared
c:/Arquivos de programas/CodeBlocks/MinGW/bin/../lib/gcc/mingw32/3.4.5/../../../
../include/stdlib.h:364: error: `size_t' has not been declared
c:/Arquivos de programas/CodeBlocks/MinGW/bin/../lib/gcc/mingw32/3.4.5/../../../
../include/stdlib.h:364: error: `size_t' has not been declared
c:/Arquivos de programas/CodeBlocks/MinGW/bin/../lib/gcc/mingw32/3.4.5/../../../
../include/stdlib.h:366: error: `size_t' has not been declared
c:/Arquivos de programas/CodeBlocks/MinGW/bin/../lib/gcc/mingw32/3.4.5/../../../
../include/stdlib.h:366: error: `size_t' has not been declared
c:/Arquivos de programas/CodeBlocks/MinGW/bin/../lib/gcc/mingw32/3.4.5/../../../
../include/stdlib.h:414: error: `size_t' has not been declared
project.cpp:76: error: expected constructor, destructor, or type conversion befo
re "enum"
project.cpp:80: error: expected constructor, destructor, or type conversion befo
re '<' token
project.cpp:119: error: expected constructor, destructor, or type conversion bef
ore '<' token
project.cpp:159:26: qscriptvalue.h: No such file or directory
project.cpp:161:34: qscriptvalueiterator.h: No such file or directory
project.cpp:156: error: `QT_END_NAMESPACE' does not name a type
project.cpp:168: error: `QMap' was not declared in this scope
project.cpp:168: error: `QString' was not declared in this scope
project.cpp:168: error: `QStringList' was not declared in this scope
project.cpp:168: error: `vars' was not declared in this scope
project.cpp:168: error: `QScriptValue' was not declared in this scope
project.cpp:169: error: initializer expression list treated as compound expressi
on
project.cpp:169: error: expected `,' or `;' before '{' token
project.cpp:178: error: `QScriptValue' does not name a type
project.cpp:192: error: `QScriptValue' does not name a type
project.cpp:206: error: `QScriptValue' does not name a type
project.cpp:235: error: `QScriptValue' does not name a type
project.cpp:243: error: `QT_END_NAMESPACE' does not name a type
project.cpp:253: error: expected constructor, destructor, or type conversion bef
ore ';' token
project.cpp:255: error: `QString' does not name a type
project.cpp:271: error: `QString' does not name a type
project.cpp:313: error: `QStringList' does not name a type
project.cpp:368: error: `QStringList' does not name a type
project.cpp:419: error: `QString' does not name a type
project.cpp:420: error: `parser_info' does not name a type
project.cpp:421: error: expected `,' or `...' before '&' token
project.cpp:421: error: ISO C++ forbids declaration of `QString' with no type
project.cpp:423: error: ISO C++ forbids declaration of `QList' with no type
project.cpp:423: error: expected `;' before '<' token
project.cpp:431: error: `QMap' has not been declared
project.cpp:431: error: expected `,' or `...' before '<' token
project.cpp:431: error: ISO C++ forbids declaration of `parameter' with no type
project.cpp: In constructor `ParsableBlock::Parse::Parse(int)':
project.cpp:421: error: class `ParsableBlock::Parse' does not have any field nam
ed `text'
project.cpp:421: error: `t' was not declared in this scope
project.cpp:421: error: `pi' was not declared in this scope
project.cpp:421: error: `parser' was not declared in this scope
project.cpp: At global scope:
project.cpp:434: error: `QMap' has not been declared
project.cpp:434: error: expected `,' or `...' before '<' token
project.cpp:435: error: ISO C++ forbids declaration of `parameter' with no type
project.cpp: In member function `bool ParsableBlock::eval(QMakeProject*, int)':
project.cpp:437: error: `parser_info' was not declared in this scope
project.cpp:437: error: expected `;' before "pi"
project.cpp:438: error: 'class QMakeProject' has no member named 'scope_blocks'
project.cpp:442: error: `parselist' was not declared in this scope
project.cpp:443: error: `parser' was not declared in this scope
project.cpp:444: error: `place' was not declared in this scope
project.cpp:449: error: `parser' was not declared in this scope
project.cpp:449: error: `pi' was not declared in this scope
project.cpp:450: error: 'class QMakeProject' has no member named 'scope_blocks'
project.cpp:451: error: 'class QMakeProject' has no member named 'scope_blocks'
project.cpp: At global scope:
project.cpp:460: error: ISO C++ forbids declaration of `QMap' with no type
project.cpp:460: error: expected `;' before '<' token
project.cpp:461: error: ISO C++ forbids declaration of `QMap' with no type
project.cpp:461: error: expected `;' before '<' token
project.cpp:462: error: `QStringList' does not name a type
project.cpp:466: error: expected `,' or `...' before '<' token
project.cpp:467: error: ISO C++ forbids declaration of `QList' with no type
project.cpp: In constructor `FunctionBlock::FunctionBlock()':
project.cpp:458: error: class `FunctionBlock' does not have any field named `cal
ling_place'
project.cpp: At global scope:
project.cpp:471: error: expected `,' or `...' before '<' token
project.cpp:474: error: ISO C++ forbids declaration of `QList' with no type
project.cpp: In member function `bool FunctionBlock::exec(int)':
project.cpp:477: error: `calling_place' was not declared in this scope
project.cpp:477: error: `place' was not declared in this scope
project.cpp:481: error: `return_value' was not declared in this scope
project.cpp:488: error: `vars' was not declared in this scope
project.cpp:491: error: `args' was not declared in this scope
project.cpp:493: error: `QString' has not been declared
project.cpp:493: error: `number' was not declared in this scope
project.cpp:495: error: `proj' was not declared in this scope
project.cpp:496: error: `functionReturn' was not declared in this scope
project.cpp: At global scope:
project.cpp:513: error: `QString' does not name a type
project.cpp:514: error: `QStringList' does not name a type
project.cpp:516: error: `parser_info' does not name a type
project.cpp:517: error: expected `,' or `...' before '&' token
project.cpp:517: error: ISO C++ forbids declaration of `QString' with no type
project.cpp:519: error: ISO C++ forbids declaration of `QList' with no type
project.cpp:519: error: expected `;' before '<' token
project.cpp:521: error: `QString' does not name a type
project.cpp:524: error: `QStringList' does not name a type
project.cpp:526: error: `QMap' has not been declared
project.cpp:526: error: expected `,' or `...' before '<' token
project.cpp:526: error: ISO C++ forbids declaration of `parameter' with no type
project.cpp: In constructor `IteratorBlock::Test::Test(int)':
project.cpp:517: error: class `IteratorBlock::Test' does not have any field name
d `func'
project.cpp:517: error: `f' was not declared in this scope
project.cpp:517: error: class `IteratorBlock::Test' does not have any field name
d `args'
project.cpp:517: error: `a' was not declared in this scope
project.cpp:517: error: `i' was not declared in this scope
project.cpp:517: error: `pi' was not declared in this scope
project.cpp:517: error: `parser' was not declared in this scope
project.cpp: At global scope:
project.cpp:529: error: `QMap' has not been declared
project.cpp:529: error: expected `,' or `...' before '<' token
project.cpp:530: error: ISO C++ forbids declaration of `parameter' with no type
project.cpp: In member function `bool IteratorBlock::exec(QMakeProject*, int)':
project.cpp:532: error: `QStringList' has not been declared
project.cpp:532: error: `Iterator' was not declared in this scope
project.cpp:532: error: expected `;' before "it"
project.cpp:534: error: `it' was not declared in this scope
project.cpp:534: error: `list' was not declared in this scope
project.cpp:541: error: `it' was not declared in this scope
project.cpp:541: error: `list' was not declared in this scope
project.cpp:549: error: `QStringList' was not declared in this scope
project.cpp:549: error: expected `;' before "va"
project.cpp:550: error: `variable' was not declared in this scope
project.cpp:551: error: `va' was not declared in this scope
project.cpp:551: error: `place' was not declared in this scope
project.cpp:553: error: `QString' has not been declared
project.cpp:553: error: `number' was not declared in this scope
project.cpp:559: error: `QList' was not declared in this scope
project.cpp:559: error: expected primary-expression before '>' token
project.cpp:559: error: `::Iterator' has not been declared
project.cpp:559: error: expected `;' before "test_it"
project.cpp:559: error: `test_it' was not declared in this scope
project.cpp:559: error: `test' was not declared in this scope
project.cpp:560: error: `parser' was not declared in this scope
project.cpp:561: error: `place' was not declared in this scope
project.cpp:568: error: `place' was not declared in this scope
project.cpp:570: error: `variable' was not declared in this scope
project.cpp:571: error: `place' was not declared in this scope
project.cpp:571: error: `va' was not declared in this scope
project.cpp: At global scope:
project.cpp:593: error: expected `,' or `...' before '&' token
project.cpp:594: error: ISO C++ forbids declaration of `QString' with no type
project.cpp: In function `void qmake_error_msg(int)':
project.cpp:595: error: `parser' was not declared in this scope
project.cpp:596: error: `msg' was not declared in this scope
project.cpp: At global scope:
project.cpp:613: error: `QStringList' does not name a type
project.cpp:693: error: `QStringList' does not name a type
project.cpp:710: error: `QStringList' does not name a type
project.cpp:714: error: expected `,' or `...' before '<' token
project.cpp:714: error: ISO C++ forbids declaration of `QMap' with no type
project.cpp:717: error: expected `,' or `...' before '<' token
project.cpp:717: error: ISO C++ forbids declaration of `QMap' with no type
project.cpp: In constructor `QMakeProjectEnv::QMakeProjectEnv(QMakeProject*)':
project.cpp:713: error: 'class QMakeProject' has no member named 'variables'
project.cpp: In constructor `QMakeProjectEnv::QMakeProjectEnv(int)':
project.cpp:714: error: `values' was not declared in this scope
project.cpp: In member function `void QMakeProjectEnv::execute(QMakeProject*)':
project.cpp:716: error: 'class QMakeProject' has no member named 'variables'
project.cpp: In member function `void QMakeProjectEnv::execute(int)':
project.cpp:728: error: `values' was not declared in this scope
project.cpp:728: error: `Q_UNUSED' was not declared in this scope
project.cpp: In destructor `QMakeProject::~QMakeProject()':
project.cpp:743: error: `prop' was not declared in this scope
project.cpp:744: error: `QMap' was not declared in this scope
project.cpp:744: error: `QString' was not declared in this scope
project.cpp:744: error: expected primary-expression before '*' token
project.cpp:744: error: expected primary-expression before '>' token
project.cpp:744: error: `::iterator' has not been declared
project.cpp:744: error: expected `;' before "it"
project.cpp:744: error: `it' was not declared in this scope
project.cpp:744: error: `replaceFunctions' was not declared in this scope
project.cpp:748: error: `replaceFunctions' was not declared in this scope
project.cpp:749: error: expected primary-expression before '*' token
project.cpp:749: error: expected primary-expression before '>' token
project.cpp:749: error: `::iterator' has not been declared
project.cpp:749: error: expected `;' before "it"
project.cpp:749: error: `it' was not declared in this scope
project.cpp:749: error: `testFunctions' was not declared in this scope
project.cpp:753: error: `testFunctions' was not declared in this scope
project.cpp: At global scope:
project.cpp:758: error: expected `,' or `...' before '<' token
project.cpp:759: error: ISO C++ forbids declaration of `QMap' with no type
project.cpp:759: error: prototype for `void QMakeProject::init(QMakeProperty*, i
nt)' does not match any in class `QMakeProject'
project.h:119: error: candidate is: void QMakeProject::init(int*, int)
project.cpp: In member function `void QMakeProject::init(QMakeProperty*, int)':
project.cpp:760: error: `vars' was not declared in this scope
project.cpp:761: error: `base_vars' was not declared in this scope
project.cpp:763: error: `prop' was not declared in this scope
project.cpp:766: error: `prop' was not declared in this scope
project.cpp: At global scope:
project.cpp:772: error: expected `,' or `...' before '<' token
project.cpp:773: error: ISO C++ forbids declaration of `QMap' with no type
project.cpp: In constructor `QMakeProject::QMakeProject(QMakeProject*, int)':
project.cpp:774: error: 'class QMakeProject' has no member named 'properties'
project.cpp:774: error: `vars' was not declared in this scope
project.cpp:774: error: 'class QMakeProject' has no member named 'variables'
project.cpp:775: error: `QString' was not declared in this scope
project.cpp:775: error: expected primary-expression before '*' token
project.cpp:775: error: expected primary-expression before '>' token
project.cpp:775: error: `::iterator' has not been declared
project.cpp:775: error: expected `;' before "it"
project.cpp:775: error: `it' was not declared in this scope
project.cpp:775: error: 'class QMakeProject' has no member named 'replaceFunctio
ns'
project.cpp:777: error: `replaceFunctions' was not declared in this scope
project.cpp:779: error: expected primary-expression before '*' token
project.cpp:779: error: expected primary-expression before '>' token
project.cpp:779: error: `::iterator' has not been declared
project.cpp:779: error: expected `;' before "it"
project.cpp:779: error: `it' was not declared in this scope
project.cpp:779: error: 'class QMakeProject' has no member named 'testFunctions'

project.cpp:781: error: `testFunctions' was not declared in this scope
project.cpp: In member function `void QMakeProject::reset()':
project.cpp:789: error: `scope_blocks' was not declared in this scope
project.cpp: At global scope:
project.cpp:796: error: expected `,' or `...' before '&' token
project.cpp:797: error: ISO C++ forbids declaration of `QString' with no type
project.cpp: In member function `bool QMakeProject::parse(int)':
project.cpp:798: error: expected `;' before "s"
project.cpp:799: error: `s' was not declared in this scope
project.cpp:805: error: `scope_blocks' was not declared in this scope
project.cpp:813: error: `parser' was not declared in this scope
project.cpp:818: error: `place' was not declared in this scope
project.cpp:823: error: `parser' was not declared in this scope
project.cpp:833: error: `parser' was not declared in this scope
project.cpp:839: error: expected `;' before "append"
project.cpp:841: error: expected initializer before '*' token
project.cpp:844: error: `d' was not declared in this scope
project.cpp:844: error: `QLatin1Char' was not declared in this scope
project.cpp:853: error: `append' was not declared in this scope
project.cpp:853: error: `d' was not declared in this scope
project.cpp:856: error: `append' was not declared in this scope
project.cpp:857: error: 'struct FunctionBlock' has no member named 'parselist'
project.cpp:860: error: `d' was not declared in this scope
project.cpp:860: error: `QString' cannot be used as a function
project.cpp:864: error: `scope_blocks' was not declared in this scope
project.cpp:865: error: expected `;' before "append"
project.cpp:867: error: expected initializer before '*' token
project.cpp:870: error: `d' was not declared in this scope
project.cpp:870: error: `QLatin1Char' was not declared in this scope
project.cpp:879: error: `append' was not declared in this scope
project.cpp:879: error: `d' was not declared in this scope
project.cpp:882: error: `append' was not declared in this scope
project.cpp:886: error: `place' was not declared in this scope
project.cpp:896: error: expected `;' before "scope"
project.cpp:897: error: `QStringList' was not declared in this scope
project.cpp:897: error: expected `;' before "val"
project.cpp:899: error: expected initializer before '*' token
project.cpp:901: error: `d' was not declared in this scope
project.cpp:901: error: `QLatin1Char' was not declared in this scope
project.cpp:904: error: `QChar' was not declared in this scope
project.cpp:904: error: expected `;' before "quote"
project.cpp:908: error: `d' was not declared in this scope
project.cpp:908: error: `QLatin1Char' was not declared in this scope
project.cpp:910: error: `d' was not declared in this scope
project.cpp:910: error: `QLatin1Char' was not declared in this scope
project.cpp:915: error: expected initializer before '*' token
project.cpp:917: error: `k' was not declared in this scope
project.cpp:918: error: `k' was not declared in this scope
project.cpp:919: error: expected `;' before "msg"
project.cpp:920: error: `QString' cannot be used as a function
project.cpp:927: error: `quote' was not declared in this scope
project.cpp:928: error: `d' was not declared in this scope
project.cpp:930: error: `d' was not declared in this scope
project.cpp:938: error: `quote' was not declared in this scope
project.cpp:939: error: `d' was not declared in this scope
project.cpp:939: error: `QLatin1Char' was not declared in this scope
project.cpp:942: error: `scope' was not declared in this scope
project.cpp:942: error: `var' was not declared in this scope
project.cpp:951: error: `scope_blocks' was not declared in this scope
project.cpp:956: error: `scope_blocks' was not declared in this scope
project.cpp:957: error: `parser' was not declared in this scope
project.cpp:958: error: `QString' cannot be used as a function
project.cpp:961: error: expected `;' before "comp_scope"
project.cpp:962: error: `comp_scope' was not declared in this scope
project.cpp:973: error: expected `;' before "func"
project.cpp:974: error: expected `;' before "args"
project.cpp:977: error: `parser' was not declared in this scope
project.cpp:979: error: `func' was not declared in this scope
project.cpp:980: error: `args' was not declared in this scope
project.cpp:982: error: `parser' was not declared in this scope
project.cpp:986: error: `parser' was not declared in this scope
project.cpp:991: error: expected `;' before "it_list"
project.cpp:992: error: `args' was not declared in this scope
project.cpp:993: error: `place' was not declared in this scope
project.cpp:994: error: `it_list' was not declared in this scope
project.cpp:999: error: `parser' was not declared in this scope
project.cpp:1004: error: 'struct IteratorBlock' has no member named 'variable'
project.cpp:1005: error: `place' was not declared in this scope
project.cpp:1006: error: `it_list' was not declared in this scope
project.cpp:1008: error: expected `;' before "list"
project.cpp:1009: error: `list' was not declared in this scope
project.cpp:1010: error: `it_list' was not declared in this scope
project.cpp:1022: error: `QString' is not a class or namespace
project.cpp:1022: error: `number' was not declared in this scope
project.cpp:1025: error: `QString' is not a class or namespace
project.cpp:1025: error: `number' was not declared in this scope
project.cpp:1032: error: 'struct IteratorBlock' has no member named 'list'
project.cpp:1032: error: `list' was not declared in this scope
project.cpp:1035: error: 'struct IteratorBlock' has no member named 'test'
project.cpp:1035: error: `args' was not declared in this scope
project.cpp:1038: error: `function_blocks' was not declared in this scope
project.cpp:1041: error: `parser' was not declared in this scope
project.cpp:1044: error: `args' was not declared in this scope
project.cpp:1046: error: `parser' was not declared in this scope
project.cpp:1049: error: `QMap' was not declared in this scope
project.cpp:1049: error: expected primary-expression before '*' token
project.cpp:1049: error: expected primary-expression before '>' token
project.cpp:1049: error: `map' was not declared in this scope
project.cpp:1051: error: `testFunctions' was not declared in this scope
project.cpp:1053: error: `replaceFunctions' was not declared in this scope
project.cpp:1062: error: `args' was not declared in this scope
project.cpp:1065: error: `args' was not declared in this scope
project.cpp:1065: error: `place' was not declared in this scope
project.cpp:1069: error: `scope_blocks' was not declared in this scope
project.cpp:1075: error: expected `;' before "cscope"
project.cpp:1076: error: `cscope' was not declared in this scope
project.cpp:1076: error: `place' was not declared in this scope
project.cpp:1084: error: `parser' was not declared in this scope
project.cpp:1099: error: 'struct IteratorBlock' has no member named 'parselist'
project.cpp:1111: error: `scope_blocks' was not declared in this scope
project.cpp:1112: error: `parser' was not declared in this scope
project.cpp:1115: error: `parser' was not declared in this scope
project.cpp:1118: error: `parser' was not declared in this scope
project.cpp:1122: error: `place' was not declared in this scope
project.cpp:1125: error: `var' was not declared in this scope
project.cpp:1129: error: `var' was not declared in this scope
project.cpp:1132: error: `scope_blocks' was not declared in this scope
project.cpp:1137: error: 'struct QMakeProject::ScopeBlock' has no member named '
else_status'
project.cpp:1139: error: 'struct QMakeProject::ScopeBlock' has no member named '
else_status'
project.cpp:1141: error: 'struct QMakeProject::ScopeBlock' has no member named '
else_status'
project.cpp:1142: error: `scope_blocks' was not declared in this scope
project.cpp:1143: error: `parser' was not declared in this scope
project.cpp:1146: error: 'struct IteratorBlock' has no member named 'parselist'
project.cpp:1147: error: `place' was not declared in this scope
project.cpp:1153: error: `scope_blocks' was not declared in this scope
project.cpp:1160: error: `d' was not declared in this scope
project.cpp:1160: error: `QLatin1Char' was not declared in this scope
project.cpp:1161: error: `op' was not declared in this scope
project.cpp:1161: error: `d' was not declared in this scope
project.cpp:1163: error: `op' was not declared in this scope
project.cpp:1163: error: `QRegExp' was not declared in this scope
project.cpp:1165: error: `d' was not declared in this scope
project.cpp:1165: error: `QLatin1Char' was not declared in this scope
project.cpp:1166: error: expected `;' before "vals"
project.cpp:1167: error: `vals' was not declared in this scope
project.cpp:1168: error: `scope_blocks' was not declared in this scope
project.cpp:1169: error: `parser' was not declared in this scope
project.cpp:1173: error: `place' was not declared in this scope
project.cpp:1177: error: `parser' was not declared in this scope
project.cpp:1183: error: `place' was not declared in this scope
project.cpp:1184: error: `varMap' was not declared in this scope
project.cpp:1186: error: `QString' does not name a type
project.cpp:1187: error: `parser' was not declared in this scope
project.cpp:1187: error: `last_file' was not declared in this scope
project.cpp:1194: error: `numLines' was not declared in this scope
project.cpp:1196: error: `parser' was not declared in this scope
project.cpp:1198: error: `varlist' was not declared in this scope
project.cpp:1201: error: expected `;' before "tmp_vals"
project.cpp:1202: error: `tmp_vals' was not declared in this scope
project.cpp:1203: error: `parser' was not declared in this scope
project.cpp:1215: error: expected `;' before "sep"
project.cpp:1216: error: expected `;' before "func"
project.cpp:1217: error: `func' was not declared in this scope
project.cpp:1223: error: `func' was not declared in this scope
project.cpp:1228: error: expected `;' before "from"
project.cpp:1230: error: `from' was not declared in this scope
project.cpp:1230: error: `QRegExp' is not a class or namespace
project.cpp:1230: error: `escape' was not declared in this scope
project.cpp:1231: error: expected `;' before "regexp"
project.cpp:1232: error: `QStringList' is not a class or namespace
project.cpp:1232: error: `Iterator' was not declared in this scope
project.cpp:1232: error: expected `;' before "varit"
project.cpp:1232: error: `varit' was not declared in this scope
project.cpp:1233: error: `regexp' was not declared in this scope
project.cpp:1234: error: `to' was not declared in this scope
project.cpp:1245: error: expected `;' before "vallist"
project.cpp:1248: error: expected `;' before "tmp"
project.cpp:1249: error: `tmp' was not declared in this scope
project.cpp:1250: error: `vallist' was not declared in this scope
project.cpp:1250: error: `doVariableReplaceExpand' was not declared in this scop
e
project.cpp:1257: error: `QSet' was not declared in this scope
project.cpp:1257: error: `incoming_vals' was not declared in this scope
project.cpp:1257: error: `vallist' was not declared in this scope
project.cpp:1259: error: `QString' does not name a type
project.cpp:1268: error: `parser' was not declared in this scope
project.cpp:1272: error: `QStringList' is not a class or namespace
project.cpp:1272: error: `ConstIterator' was not declared in this scope
project.cpp:1272: error: expected `;' before "valit"
project.cpp:1273: error: `valit' was not declared in this scope
project.cpp:1273: error: `vallist' was not declared in this scope
project.cpp:1283: error: `vallist' was not declared in this scope
project.cpp: At global scope:
project.cpp:1289: error: `bool QMakeProject::read' is not a static member of `cl
ass QMakeProject'
project.cpp:1289: error: `QTextStream' was not declared in this scope
project.cpp:1289: error: `file' was not declared in this scope
project.cpp:1289: error: `QMap' was not declared in this scope
project.cpp:1289: error: `QString' was not declared in this scope
project.cpp:1289: error: `QStringList' was not declared in this scope
project.cpp:1289: error: `place' was not declared in this scope
project.cpp:1290: error: initializer expression list treated as compound express
ion
project.cpp:1290: error: expected `,' or `;' before '{' token
project.cpp:1332: error: expected `,' or `...' before '&' token
project.cpp:1333: error: ISO C++ forbids declaration of `QString' with no type
project.cpp: In member function `bool QMakeProject::read(int)':
project.cpp:1334: error: `parser_info' was not declared in this scope
project.cpp:1334: error: expected `;' before "pi"
project.cpp:1337: error: `QString' does not name a type
project.cpp:1338: error: expected `;' before "filename"
project.cpp:1339: error: `filename' was not declared in this scope
project.cpp:1339: error: `place' was not declared in this scope
project.cpp:1341: error: `QFile' was not declared in this scope
project.cpp:1341: error: expected `;' before "qfile"
project.cpp:1342: error: `strcmp' was not declared in this scope
project.cpp:1343: error: `qfile' was not declared in this scope
project.cpp:1344: error: `QIODevice' has not been declared
project.cpp:1344: error: `ReadOnly' was not declared in this scope
project.cpp:1346: error: `file' was not declared in this scope
project.cpp:1346: error: `QFileInfo' was not declared in this scope
project.cpp:1349: error: `qfile' was not declared in this scope
project.cpp:1350: error: `QIODevice' has not been declared
project.cpp:1350: error: `ReadOnly' was not declared in this scope
project.cpp:1354: error: expected `;' before "pi"
project.cpp:1355: error: `parser' was not declared in this scope
project.cpp:1358: error: `QTextStream' was not declared in this scope
project.cpp:1358: error: expected `;' before "t"
project.cpp:1359: error: `t' was not declared in this scope
project.cpp:1361: error: `qfile' was not declared in this scope
project.cpp:1363: error: `scope_blocks' was not declared in this scope
project.cpp:1364: error: invalid conversion from `const char*' to `int'
project.cpp:1364: error:   initializing argument 1 of `void qmake_error_msg(int)
'
project.cpp:1367: error: `parser' was not declared in this scope
project.cpp:1367: error: `pi' was not declared in this scope
project.cpp:1368: error: `oldpwd' was not declared in this scope
project.cpp: At global scope:
project.cpp:1373: error: expected `,' or `...' before '&' token
project.cpp:1374: error: ISO C++ forbids declaration of `QString' with no type
project.cpp:1374: error: redefinition of `bool QMakeProject::read(int)'
project.cpp:1333: error: `bool QMakeProject::read(int)' previously defined here
project.cpp: In member function `bool QMakeProject::read(int)':
project.cpp:1375: error: `pfile' was not declared in this scope
project.cpp:1375: error: `project' was not declared in this scope
project.cpp:1375: error: `QFileInfo' was not declared in this scope
project.cpp:1376: error: `cmd' was not declared in this scope
project.cpp: At global scope:
project.cpp:1380: error: `bool QMakeProject::read' is not a static member of `cl
ass QMakeProject'
project.cpp:1380: error: `uchar' was not declared in this scope
project.cpp:1381: error: expected `,' or `;' before '{' token
project.cpp:1609: error: expected `,' or `...' before '&' token
project.cpp:1610: error: ISO C++ forbids declaration of `QString' with no type
project.cpp: In member function `bool QMakeProject::isActiveConfig(int)':
project.cpp:1611: error: `x' was not declared in this scope
project.cpp:1615: error: `x' was not declared in this scope
project.cpp:1622: error: `x' was not declared in this scope
project.cpp:1635: error: `QRegExp' was not declared in this scope
project.cpp:1635: error: expected `;' before "re"
project.cpp:1636: error: `QString' does not name a type
project.cpp:1637: error: `spec' was not declared in this scope
project.cpp:1638: error: `qmakespec' is not a member of `Option::mkfile'
project.cpp:1638: error: `QFileInfo' was not declared in this scope
project.cpp:1639: error: `regex' was not declared in this scope
project.cpp:1639: error: `re' was not declared in this scope
project.cpp:1639: error: `spec' was not declared in this scope
project.cpp:1639: error: `x' was not declared in this scope
project.cpp:1676: error: expected initializer before '&' token
project.cpp:1677: error: `QStringList' has not been declared
project.cpp:1677: error: `ConstIterator' was not declared in this scope
project.cpp:1677: error: expected `;' before "it"
project.cpp:1677: error: `it' was not declared in this scope
project.cpp:1677: error: `configs' was not declared in this scope
project.cpp:1678: error: `regex' was not declared in this scope
project.cpp:1678: error: `re' was not declared in this scope
project.cpp:1678: error: `x' was not declared in this scope
project.cpp: At global scope:
project.cpp:1685: error: `bool QMakeProject::doProjectTest' is not a static memb
er of `class QMakeProject'
project.cpp:1685: error: `QString' was not declared in this scope
project.cpp:1685: error: `QMap' was not declared in this scope
project.cpp:1685: error: `QString' was not declared in this scope
project.cpp:1685: error: `QStringList' was not declared in this scope
project.cpp:1685: error: `place' was not declared in this scope
project.cpp:1686: error: initializer expression list treated as compound express
ion
project.cpp:1686: error: expected `,' or `;' before '{' token
project.cpp:1713: error: `bool QMakeProject::doProjectTest' is not a static memb
er of `class QMakeProject'
project.cpp:1713: error: `QString' was not declared in this scope
project.cpp:1713: error: expected primary-expression before "const"
project.cpp:1714: error: `QMap' was not declared in this scope
project.cpp:1714: error: `QString' was not declared in this scope
project.cpp:1714: error: `QStringList' was not declared in this scope
project.cpp:1714: error: `place' was not declared in this scope
project.cpp:1715: error: initializer expression list treated as compound express
ion
project.cpp:1715: error: expected `,' or `;' before '{' token
project.cpp:1720: error: `QMakeProject::IncludeStatus QMakeProject::doProjectInc
lude' is not a static member of `class QMakeProject'
project.cpp:1720: error: `QString' was not declared in this scope
project.cpp:1720: error: `uchar' was not declared in this scope
project.cpp:1720: error: `QMap' was not declared in this scope
project.cpp:1720: error: `QString' was not declared in this scope
project.cpp:1720: error: `QStringList' was not declared in this scope
project.cpp:1720: error: `place' was not declared in this scope
project.cpp:1721: error: initializer expression list treated as compound express
ion
project.cpp:1721: error: expected `,' or `;' before '{' token
project.cpp:1874: error: `QStringList' does not name a type
project.cpp:1881: error: `QStringList' does not name a type
project.cpp:1895: error: `QStringList' does not name a type
project.cpp:2343: error: `bool QMakeProject::doProjectTest' is not a static memb
er of `class QMakeProject'
project.cpp:2343: error: `QString' was not declared in this scope
project.cpp:2343: error: `QStringList' was not declared in this scope
project.cpp:2343: error: `QMap' was not declared in this scope
project.cpp:2343: error: `QString' was not declared in this scope
project.cpp:2343: error: `QStringList' was not declared in this scope
project.cpp:2343: error: `place' was not declared in this scope
project.cpp:2344: error: initializer expression list treated as compound express
ion
project.cpp:2344: error: expected `,' or `;' before '{' token
project.cpp:2356: error: `bool QMakeProject::doProjectTest' is not a static memb
er of `class QMakeProject'
project.cpp:2356: error: `QString' was not declared in this scope
project.cpp:2356: error: `QList' was not declared in this scope
project.cpp:2356: error: `QStringList' was not declared in this scope
project.cpp:2356: error: `args_list' was not declared in this scope
project.cpp:2356: error: `QMap' was not declared in this scope
project.cpp:2356: error: `QString' was not declared in this scope
project.cpp:2356: error: `QStringList' was not declared in this scope
project.cpp:2356: error: `place' was not declared in this scope
project.cpp:2357: error: initializer expression list treated as compound express
ion
project.cpp:2357: error: expected `,' or `;' before '{' token
project.cpp:2818: error: expected `,' or `...' before '&' token
project.cpp:2819: error: ISO C++ forbids declaration of `QStringList' with no ty
pe
project.cpp: In member function `bool QMakeProject::doProjectCheckReqs(int)':
project.cpp:2821: error: `QStringList' is not a class or namespace
project.cpp:2821: error: `ConstIterator' was not declared in this scope
project.cpp:2821: error: expected `;' before "it"
project.cpp:2821: error: `it' was not declared in this scope
project.cpp:2821: error: `deps' was not declared in this scope
project.cpp:2822: error: `place' was not declared in this scope
project.cpp:2825: error: `parser' was not declared in this scope
project.cpp: At global scope:
project.cpp:2835: error: expected `,' or `...' before '&' token
project.cpp:2836: error: ISO C++ forbids declaration of `QString' with no type
project.cpp: In member function `bool QMakeProject::test(int)':
project.cpp:2837: error: `QMap' was not declared in this scope
project.cpp:2837: error: `QStringList' was not declared in this scope
project.cpp:2837: error: `tmp' was not declared in this scope
project.cpp:2837: error: `vars' was not declared in this scope
project.cpp:2838: error: `v' was not declared in this scope
project.cpp: At global scope:
project.cpp:2842: error: expected `,' or `...' before '&' token
project.cpp:2843: error: ISO C++ forbids declaration of `QString' with no type
project.cpp:2843: error: redefinition of `bool QMakeProject::test(int)'
project.cpp:2836: error: `bool QMakeProject::test(int)' previously defined here
project.cpp:2843: confused by earlier errors, bailing out
mingw32-make: *** [project.o] Error 1
Building qmake failed, return code 2

emerge fatal error: os.system ( echo y | configure.exe -platform win32-g++ -pref
ix c:\kderoot\tmp\qt-4.4.0.20080222\image-mingw\ -qt-gif -qt-libpng -qt-libjpeg
-qt-libtiff -qdbus -openssl -fast -no-vcproj -no-dsp -I c:\kderoot\tmp\qt-4.4.0.
20080222\work\3rdparty\include -L c:\kderoot\tmp\qt-4.4.0.20080222\work\3rdparty
\lib  -release  ) failed
emerge fatal error: running python c:\kderoot\emerge\portage\libs\qt\qt-4.4.0.20
080222.py compile
emerge error: fatal error: package libs/qt-4.4.0.20080222 all failed


C:\kderoot\emerge\bin>