All pastes #940471 Raw Edit

genuse

public text v1 · immutable
·published 2008-03-13 00:06 UTC
rendered paste body
stage1/xgcc -Bstage1/ -B/usr/i686-pc-linux-gnu/bin/ -c   -O2 -march=i686 -pipe -fprofile-generate -DIN_GCC   -W -Wall -Wwrite-strings -Wstrict-prototypes -Wmissing-prototypes -pedantic -Wno-long-long -Wno-variadic-macros -Wold-style-definition -Wmissing-format-attribute     -DHAVE_CONFIG_H -I. -Icp -I/var/tmp/portage/sys-devel/gcc-4.1.2/work/gcc-4.1.2/gcc -I/var/tmp/portage/sys-devel/gcc-4.1.2/work/gcc-4.1.2/gcc/cp -I/var/tmp/portage/sys-devel/gcc-4.1.2/work/gcc-4.1.2/gcc/../include -I/var/tmp/portage/sys-devel/gcc-4.1.2/work/gcc-4.1.2/gcc/../libcpp/include     /var/tmp/portage/sys-devel/gcc-4.1.2/work/gcc-4.1.2/gcc/cp/decl.c -o cp/decl.o
{standard input}: Assembler messages:
{standard input}:32721: Fatal error: can't write cp/decl.o: No space left on device
{standard input}:32721: Fatal error: can't close cp/decl.o: No space left on device
make[2]: *** [cp/decl.o] Error 1
make[2]: Leaving directory `/var/tmp/portage/sys-devel/gcc-4.1.2/work/build/gcc'
make[1]: *** [stageprofile_build] Error 2
make[1]: Leaving directory `/var/tmp/portage/sys-devel/gcc-4.1.2/work/build/gcc'
make: *** [profiledbootstrap] Error 2
 [31;01m*[0m 
 [31;01m*[0m ERROR: sys-devel/gcc-4.1.2 failed.
 [31;01m*[0m Call stack:
 [31;01m*[0m               ebuild.sh, line   49:  Called src_compile
 [31;01m*[0m             environment, line 4524:  Called toolchain_src_compile
 [31;01m*[0m             environment, line 4995:  Called gcc_src_compile
 [31;01m*[0m             environment, line 2879:  Called gcc_do_make
 [31;01m*[0m             environment, line 2709:  Called die
 [31;01m*[0m The specific snippet of code:
 [31;01m*[0m       emake LDFLAGS="${LDFLAGS}" STAGE1_CFLAGS="${STAGE1_CFLAGS}" LIBPATH="${LIBPATH}" BOOT_CFLAGS="${BOOT_CFLAGS}" ${GCC_MAKE_TARGET} || die "emake failed with ${GCC_MAKE_TARGET}";
 [31;01m*[0m  The die message:
 [31;01m*[0m   emake failed with profiledbootstrap
 [31;01m*[0m 
 [31;01m*[0m If you need support, post the topmost build error, and the call stack if relevant.
 [31;01m*[0m A complete build log is located at '/var/tmp/portage/sys-devel/gcc-4.1.2/temp/build.log'.
 [31;01m*[0m The ebuild environment file is located at '/var/tmp/portage/sys-devel/gcc-4.1.2/temp/environment'.
 [31;01m*[0m