[ 77%] Building CXX object astrogen/CMakeFiles/designer.dir/designer.o
/usr/bin/c++ -I/usr/include/QtCore -I/usr/include/QtGui -I/home/kde4/kdesvn/playground/games/astrododge/astrogen -I/home/kde4/kdesvn/playground/games/astrododge/astrogen/../src -I/usr/local/include -DQT_SHARED -Wall -o astrogen/CMakeFiles/designer.dir/designer.o -c /home/kde4/kdesvn/playground/games/astrododge/astrogen/designer.cpp
In file included from /home/kde4/kdesvn/playground/games/astrododge/astrogen/designer.h:23,
from /home/kde4/kdesvn/playground/games/astrododge/astrogen/designer.cpp:18:
/home/kde4/kdesvn/playground/games/astrododge/astrogen/ui_designer.h:27:25: error: qformlayout.h: No such file or directory
In file included from /home/kde4/kdesvn/playground/games/astrododge/astrogen/designer.h:23,
from /home/kde4/kdesvn/playground/games/astrododge/astrogen/designer.cpp:18:
/home/kde4/kdesvn/playground/games/astrododge/astrogen/ui_designer.h:39: error: ISO C++ forbids declaration of ‘QFormLayout’ with no type
/home/kde4/kdesvn/playground/games/astrododge/astrogen/ui_designer.h:39: error: expected ‘;’ before ‘*’ token
/home/kde4/kdesvn/playground/games/astrododge/astrogen/ui_designer.h:45: error: ISO C++ forbids declaration of ‘QFormLayout’ with no type
/home/kde4/kdesvn/playground/games/astrododge/astrogen/ui_designer.h:45: error: expected ‘;’ before ‘*’ token
/home/kde4/kdesvn/playground/games/astrododge/astrogen/ui_designer.h: In member function ‘void Ui_Designer::setupUi(QWidget*)’:
/home/kde4/kdesvn/playground/games/astrododge/astrogen/ui_designer.h:91: error: ‘formLayout’ was not declared in this scope
/home/kde4/kdesvn/playground/games/astrododge/astrogen/ui_designer.h:91: error: expected type-specifier before ‘QFormLayout’
/home/kde4/kdesvn/playground/games/astrododge/astrogen/ui_designer.h:91: error: expected `;' before ‘QFormLayout’
/home/kde4/kdesvn/playground/games/astrododge/astrogen/ui_designer.h:121: error: ‘formLayout1’ was not declared in this scope
/home/kde4/kdesvn/playground/games/astrododge/astrogen/ui_designer.h:121: error: expected type-specifier before ‘QFormLayout’
/home/kde4/kdesvn/playground/games/astrododge/astrogen/ui_designer.h:121: error: expected `;' before ‘QFormLayout’
make[2]: *** [astrogen/CMakeFiles/designer.dir/designer.o] Error 1
make[2]: Leaving directory `/home/kde4/kdesvn/playground/games/astrododge'
make[1]: *** [astrogen/CMakeFiles/designer.dir/all] Error 2
make[1]: Leaving directory `/home/kde4/kdesvn/playground/games/astrododge'
make: *** [all] Error 2
makeobj[0]: Leaving directory `/home/kde4/kdesvn/playground/games/astrododge'