make check-recursive
make[1]: Entering directory `/home/Tomjon/lemur/xappy/libs/xapian-core'
Making check in .
make[2]: Entering directory `/home/Tomjon/lemur/xappy/libs/xapian-core'
make[2]: Leaving directory `/home/Tomjon/lemur/xappy/libs/xapian-core'
Making check in docs
make[2]: Entering directory `/home/Tomjon/lemur/xappy/libs/xapian-core/docs'
make[2]: Nothing to be done for `check'.
make[2]: Leaving directory `/home/Tomjon/lemur/xappy/libs/xapian-core/docs'
Making check in tests
make[2]: Entering directory `/home/Tomjon/lemur/xappy/libs/xapian-core/tests'
make check-am
make[3]: Entering directory `/home/Tomjon/lemur/xappy/libs/xapian-core/tests'
make btreetest.exe quartztest.exe apitest.exe internaltest.exe stemtest.exe queryparsertest.exe termgentest.exe runtest
make[4]: Entering directory `/home/Tomjon/lemur/xappy/libs/xapian-core/tests'
make[4]: `btreetest.exe' is up to date.
make[4]: `quartztest.exe' is up to date.
make[4]: `apitest.exe' is up to date.
make[4]: `internaltest.exe' is up to date.
make[4]: `stemtest.exe' is up to date.
make[4]: `queryparsertest.exe' is up to date.
make[4]: `termgentest.exe' is up to date.
make[4]: `runtest' is up to date.
make[4]: Leaving directory `/home/Tomjon/lemur/xappy/libs/xapian-core/tests'
make check-TESTS
make[4]: Entering directory `/home/Tomjon/lemur/xappy/libs/xapian-core/tests'
Running test: simple1... ok
Running test: insertdelete1... ok
Running test: sequent1... ok
Running test: emptykey1... ok
Running test: table1... ok
Running test: table2... ok
Running test: table3... ok
Running test: table4... ok
Running test: table5... ok
Running test: table6... ok
Running test: cursor1... ok
Running test: cursor2... ok
Running test: cursor3... ok
Running test: bitmap1... ok
Running test: overwrite1... ok
/home/Tomjon/lemur/xappy/libs/xapian-core/tests/.libs/btreetest completed test run: All 15 tests passed.
PASS: btreetest.exe
Running test: create1... ok
Running test: adddoc1... ok
Running test: packint1... ok
Running test: packint2... ok
Running test: packint3... ok
Running test: unpackint1... ok
Running test: writelock1... ok
Running test: packstring1... ok
/home/Tomjon/lemur/xappy/libs/xapian-core/tests/.libs/quartztest completed test run: All 8 tests passed.
PASS: quartztest.exe
Running tests with backend "none"...
Running test: defaultctor1... ok
Running test: copyassign1... ok
Running test: trivial1... ok
Running test: getqterms1... ok
Running test: getqterms2... ok
Running test: emptyquery2... ok
Running test: emptyquery3... ok
Running test: querylen1... ok
Running test: querylen2... ok
Running test: queryvalid1... ok
Running test: subqcollapse1... ok
Running test: emptyquerypart1... ok
Running test: singlesubq1... ok
Running test: stemlangs1... ok
Running test: weight1... ok
Running test: nosuchdb1... ok
Running test: addvalue1... ok
Running test: poscollapse2... ok
Running test: uninitdb1... ok
Running test: stringlistserialise1... ok
Running test: scaleweight3... ok
Running test: scaleweight4... ok
Running test: utf8iterator1... ok
Running test: utf8iterator2... ok
Running test: unicode1... ok
Running test: caseconvert1... ok
/home/Tomjon/lemur/xappy/libs/xapian-core/tests/.libs/apitest completed test run: All 26 tests passed.
Running tests with backend "inmemory"...
Running test: zerodocid1... ok
Running test: emptyquery1... ok
Running test: simplequery1... ok
Running test: simplequery2... ok
Running test: simplequery3... ok
Running test: wildquery1... ok
Running test: multidb1... ok
Running test: msetmaxitems1... ok
Running test: expandweights1... ok
Running test: expandweights2... ok
Running test: expandmaxitems1... ok
Running test: boolquery1... ok
Running test: msetfirst1... ok
Running test: topercent1... ok
Running test: expandfunctor1... ok
Running test: pctcutoff1... ok
Running test: cutoff1... ok
Running test: allowqterms1... ok
Running test: maxattain1... ok
Running test: reversebool1... ok
Running test: reversebool2... ok
Running test: getmterms1... ok
Running test: getmterms2... ok
Running test: poscollapse1... ok
Running test: repeatquery1... ok
Running test: fetchdocs1... ok
Running test: absentterm1... ok
Running test: absentterm2... ok
Running test: rset1... ok
Running test: rset2... ok
Running test: eliteset1... ok
Running test: eliteset2... ok
Running test: eliteset3... ok
Running test: eliteset4... ok
Running test: termlisttermfreq1... ok
Running test: qterminfo1... ok
Running test: qterminfo2... ok
Running test: msetzeroitems1... ok
Running test: matches1... ok
Running test: wqf1... ok
Running test: qlen1... ok
Running test: termlist1... ok
Running test: termlist2... ok
Running test: termlist3... ok
Running test: termlist4... ok
Running test: puncterms1... ok
Running test: spaceterms1... ok
Running test: xor1... ok
Running test: getdoc1... ok
Running test: emptyop1... ok
Running test: checkatleast1... ok
Running test: checkatleast2... ok
Running test: checkatleast3... ok
Running test: allpostlist1... ok
Running test: emptyterm1... ok
Running test: valuerange1... ok
Running test: valuege1... ok
Running test: valuele1... ok
Running test: scaleweight1... ok
Running test: scaleweight2... ok
Running test: bm25weight1... ok
Running test: tradweight1... ok
Running test: termstats... ok
Running test: msetiterator1... ok
Running test: msetiterator2... ok
Running test: msetiterator3... ok
Running test: esetiterator1... ok
Running test: esetiterator2... ok
Running test: collapsekey1... ok
Running test: collapsekey2... SKIPPED
Running test: collapsekey3... ok
Running test: collapsekey4... ok
Running test: allterms1... ok
Running test: allterms2... ok
Running test: allterms3... ok
Running test: allterms4... ok
Running test: allterms5... ok
Running test: allterms6... ok
Running test: specialterms1... ok
Running test: specialterms2... ok
Running test: postlist1... ok
Running test: postlist2... ok
Running test: postlist3... ok
Running test: postlist4... ok
Running test: postlist5... ok
Running test: postlist6... ok
Running test: collfreq1... ok
Running test: sortvalue1... ok
Running test: synonym1...
Xapian::Query(date)
Xapian::Query((sky SYNONYM date))
Xapian::Query((date SYNONYM (sky OR glove)))
Xapian::Query((sky SYNONYM date SYNONYM stein SYNONYM ally))
Xapian::Query((sky SYNONYM (date PHRASE 2 stein)))
FAILED
Running test: synonym2... ok
Running test: sortrel1... ok
Running test: matchall1... ok
Running test: docsim1... ok
/home/Tomjon/lemur/xappy/libs/xapian-core/tests/.libs/apitest completed test run: 91 tests passed, 1 failed, 1 skipped.
Running test: multidb2... ok
Running test: multidb3... ok
Running test: multidb4... ok
Running test: multidb5... ok
Running test: rsetmultidb1... ok
Running test: rsetmultidb3... ok
Running test: rsetmultidb2... ok
Running test: multiexpand1... ok
/home/Tomjon/lemur/xappy/libs/xapian-core/tests/.libs/apitest completed test run: All 8 tests passed.
Running test: matchfunctor1... ok
Running test: matchfunctor2... ok
Running test: matchfunctor3... ok
Running test: consistency1... ok
Running test: userweight1... ok
Running test: sortfunctor1... ok
/home/Tomjon/lemur/xappy/libs/xapian-core/tests/.libs/apitest completed test run: All 6 tests passed.
Running test: near1... ok
Running test: near2... ok
Running test: phrase1... ok
Running test: phrase2... ok
Running test: poslist1... ok
Running test: positfromtermit1... ok
/home/Tomjon/lemur/xappy/libs/xapian-core/tests/.libs/apitest completed test run: All 6 tests passed.
Running test: poslist2... ok
Running test: poslist3... ok
/home/Tomjon/lemur/xappy/libs/xapian-core/tests/.libs/apitest completed test run: All 2 tests passed.
Running test: adddoc1... ok
Running test: adddoc2... ok
Running test: adddoc3... ok
Running test: adddoc4... ok
Running test: adddoc5... SKIPPED
Running test: adddoc6... SKIPPED
Running test: implicitendsession1... ok
Running test: databaseassign1... ok
Running test: deldoc1... ok
Running test: deldoc2... ok
Running test: deldoc3... ok
Running test: deldoc4... ok
Running test: deldoc5... ok
Running test: deldoc6... ok
Running test: replacedoc1... ok
Running test: replacedoc2... ok
Running test: replacedoc3... ok
Running test: replacedoc4... ok
Running test: replacedoc5... ok
Running test: uniqueterm1... ok
Running test: allpostlist2... ok
Running test: emptyterm2... ok
Running test: phraseorneartoand1... ok
Running test: longpositionlist1... ok
Running test: crashrecovery1... SKIPPED
Running test: nomoredocids1... SKIPPED
Running test: synonymitor1... SKIPPED
Running test: matchspy1... ok
Running test: matchspy2... ok
Running test: matchspy3... ok
Running test: metadata1... ok
Running test: termtoolong1... SKIPPED
Running test: postlist7... ok
/home/Tomjon/lemur/xappy/libs/xapian-core/tests/.libs/apitest completed test run: All 27 tests passed, 6 skipped.
Running test: sortfunctor2... ok
/home/Tomjon/lemur/xappy/libs/xapian-core/tests/.libs/apitest completed test run: All 1 tests passed.
Running tests with backend "flint"...
Running test: zerodocid1... ok
Running test: emptyquery1... ok
Running test: simplequery1... ok
Running test: simplequery2... ok
Running test: simplequery3... ok
Running test: wildquery1... ok
Running test: multidb1... ok
Running test: msetmaxitems1... ok
Running test: expandweights1... ok
Running test: expandweights2... ok
Running test: expandmaxitems1... ok
Running test: boolquery1... ok
Running test: msetfirst1... ok
Running test: topercent1... ok
Running test: expandfunctor1... ok
Running test: pctcutoff1... ok
Running test: cutoff1... ok
Running test: allowqterms1... ok
Running test: maxattain1... ok
Running test: reversebool1... ok
Running test: reversebool2... ok
Running test: getmterms1... ok
Running test: getmterms2... ok
Running test: poscollapse1... ok
Running test: repeatquery1... ok
Running test: fetchdocs1... ok
Running test: absentterm1... ok
Running test: absentterm2... ok
Running test: rset1... ok
Running test: rset2... ok
Running test: eliteset1... ok
Running test: eliteset2... ok
Running test: eliteset3... ok
Running test: eliteset4... ok
Running test: termlisttermfreq1... ok
Running test: qterminfo1... ok
Running test: qterminfo2... ok
Running test: msetzeroitems1... ok
Running test: matches1... ok
Running test: wqf1... ok
Running test: qlen1... ok
Running test: termlist1... ok
Running test: termlist2... ok
Running test: termlist3... ok
Running test: termlist4... ok
Running test: puncterms1... ok
Running test: spaceterms1... ok
Running test: xor1... ok
Running test: getdoc1... ok
Running test: emptyop1... ok
Running test: checkatleast1... ok
Running test: checkatleast2... ok
Running test: checkatleast3... ok
Running test: allpostlist1... ok
Running test: emptyterm1... ok
Running test: valuerange1... ok
Running test: valuege1... ok
Running test: valuele1... ok
Running test: scaleweight1... ok
Running test: scaleweight2... ok
Running test: bm25weight1... ok
Running test: tradweight1... ok
Running test: termstats... ok
Running test: msetiterator1... ok
Running test: msetiterator2... ok
Running test: msetiterator3... ok
Running test: esetiterator1... ok
Running test: esetiterator2... ok
Running test: collapsekey1... ok
Running test: collapsekey2... SKIPPED
Running test: collapsekey3... ok
Running test: collapsekey4... ok
Running test: allterms1... ok
Running test: allterms2... ok
Running test: allterms3... ok
Running test: allterms4... ok
Running test: allterms5... ok
Running test: allterms6... ok
Running test: specialterms1... ok
Running test: specialterms2... ok
Running test: postlist1... ok
Running test: postlist2... ok
Running test: postlist3... ok
Running test: postlist4... ok
Running test: postlist5... ok
Running test: postlist6... ok
Running test: collfreq1... ok
Running test: sortvalue1... ok
Running test: synonym1...
Xapian::Query(date)
Xapian::Query((sky SYNONYM date))
Xapian::Query((date SYNONYM (sky OR glove)))
Xapian::Query((sky SYNONYM date SYNONYM stein SYNONYM ally))
Xapian::Query((sky SYNONYM (date PHRASE 2 stein)))
FAILED
Running test: synonym2... ok
Running test: sortrel1... ok
Running test: matchall1... ok
Running test: docsim1... ok
/home/Tomjon/lemur/xappy/libs/xapian-core/tests/.libs/apitest completed test run: 91 tests passed, 1 failed, 1 skipped.
Running test: multidb2... ok
Running test: multidb3... ok
Running test: multidb4... ok
Running test: multidb5... ok
Running test: rsetmultidb1... ok
Running test: rsetmultidb3... ok
Running test: rsetmultidb2... ok
Running test: multiexpand1... ok
/home/Tomjon/lemur/xappy/libs/xapian-core/tests/.libs/apitest completed test run: All 8 tests passed.
Running test: matchfunctor1... ok
Running test: matchfunctor2... ok
Running test: matchfunctor3... ok
Running test: consistency1... ok
Running test: userweight1... ok
Running test: sortfunctor1... ok
/home/Tomjon/lemur/xappy/libs/xapian-core/tests/.libs/apitest completed test run: All 6 tests passed.
Running test: stubdb1... ok
Running test: flintdatabaseopeningerror1... ok
Running test: flintdatabaseformaterror1... ok
Running test: flintdatabaseformaterror2... ok
Running test: flintdatabaseformaterror3... ok
Running test: flintbackwardcompat1... ok
Running test: flintbackwardcompat2... ok
Running test: flintdatabaseopen1... ok
/home/Tomjon/lemur/xappy/libs/xapian-core/tests/.libs/apitest completed test run: All 8 tests passed.
Running test: metadata2... ok
Running test: metadata3... ok
Running test: metadata4... ok
/home/Tomjon/lemur/xappy/libs/xapian-core/tests/.libs/apitest completed test run: All 3 tests passed.
Running test: near1... ok
Running test: near2... ok
Running test: phrase1... ok
Running test: phrase2... ok
Running test: poslist1... ok
Running test: positfromtermit1... ok
/home/Tomjon/lemur/xappy/libs/xapian-core/tests/.libs/apitest completed test run: All 6 tests passed.
Running test: poslist2... ok
Running test: poslist3... ok
/home/Tomjon/lemur/xappy/libs/xapian-core/tests/.libs/apitest completed test run: All 2 tests passed.
Running test: replicate1...rm: cannot remove directory `.replicatmp/replica/replica_1': Directory not empty
ok
/home/Tomjon/lemur/xappy/libs/xapian-core/tests/.libs/apitest completed test run: All 1 tests passed.
Running test: spell1... ok
Running test: spell2... ok
Running test: spell3... ok
Running test: spell4... ok
Running test: spell5... ok
/home/Tomjon/lemur/xappy/libs/xapian-core/tests/.libs/apitest completed test run: All 5 tests passed.
Running test: badtransaction1... ok
Running test: committransaction1... ok
Running test: canceltransaction1... ok
Running test: canceltransaction2... ok
/home/Tomjon/lemur/xappy/libs/xapian-core/tests/.libs/apitest completed test run: All 4 tests passed.
Running test: adddoc1... ok
Running test: adddoc2... ok
Running test: adddoc3... ok
Running test: adddoc4... ok
Running test: adddoc5... ok
Running test: adddoc6... ok
Running test: implicitendsession1... ok
Running test: databaseassign1... ok
Running test: deldoc1... ok
Running test: deldoc2... ok
Running test: deldoc3... ok
Running test: deldoc4... ok
Running test: deldoc5... ok
Running test: deldoc6... ok
Running test: replacedoc1... ok
Running test: replacedoc2... ok
Running test: replacedoc3... ok
Running test: replacedoc4... ok
Running test: replacedoc5... ok
Running test: uniqueterm1... ok
Running test: allpostlist2... ok
Running test: emptyterm2... ok
Running test: phraseorneartoand1... ok
Running test: longpositionlist1... ok
Running test: crashrecovery1... ok
Running test: nomoredocids1... ok
Running test: synonymitor1... ok
Running test: matchspy1... ok
Running test: matchspy2... ok
Running test: matchspy3... ok
Running test: metadata1... ok
Running test: termtoolong1... ok
Running test: postlist7... ok
/home/Tomjon/lemur/xappy/libs/xapian-core/tests/.libs/apitest completed test run: All 33 tests passed.
Running test: sortfunctor2... ok
/home/Tomjon/lemur/xappy/libs/xapian-core/tests/.libs/apitest completed test run: All 1 tests passed.
Running tests with backend "multi"...
Running test: zerodocid1... ok
Running test: emptyquery1... ok
Running test: simplequery1... ok
Running test: simplequery2... ok
Running test: simplequery3... ok
Running test: wildquery1... ok
Running test: multidb1... ok
Running test: msetmaxitems1... ok
Running test: expandweights1... ok
Running test: expandweights2... ok
Running test: expandmaxitems1... ok
Running test: boolquery1... ok
Running test: msetfirst1... ok
Running test: topercent1... ok
Running test: expandfunctor1... ok
Running test: pctcutoff1... ok
Running test: cutoff1... ok
Running test: allowqterms1... ok
Running test: maxattain1... ok
Running test: reversebool1... ok
Running test: reversebool2... ok
Running test: getmterms1... ok
Running test: getmterms2... ok
Running test: poscollapse1... ok
Running test: repeatquery1... ok
Running test: fetchdocs1... ok
Running test: absentterm1... ok
Running test: absentterm2... ok
Running test: rset1... ok
Running test: rset2... ok
Running test: eliteset1... SKIPPED
Running test: eliteset2... SKIPPED
Running test: eliteset3... ok
Running test: eliteset4... SKIPPED
Running test: termlisttermfreq1... ok
Running test: qterminfo1... ok
Running test: qterminfo2... ok
Running test: msetzeroitems1... ok
Running test: matches1... ok
Running test: wqf1... ok
Running test: qlen1... ok
Running test: termlist1... ok
Running test: termlist2... ok
Running test: termlist3... ok
Running test: termlist4... ok
Running test: puncterms1... ok
Running test: spaceterms1... ok
Running test: xor1... ok
Running test: getdoc1... ok
Running test: emptyop1... ok
Running test: checkatleast1... ok
Running test: checkatleast2... ok
Running test: checkatleast3... ok
Running test: allpostlist1... ok
Running test: emptyterm1... ok
Running test: valuerange1... ok
Running test: valuege1... ok
Running test: valuele1... ok
Running test: scaleweight1... ok
Running test: scaleweight2... ok
Running test: bm25weight1... ok
Running test: tradweight1... ok
Running test: termstats... ok
Running test: msetiterator1... ok
Running test: msetiterator2... ok
Running test: msetiterator3... ok
Running test: esetiterator1... ok
Running test: esetiterator2... ok
Running test: collapsekey1... ok
Running test: collapsekey2... SKIPPED
Running test: collapsekey3... ok
Running test: collapsekey4... ok
Running test: allterms1... ok
Running test: allterms2... ok
Running test: allterms3... ok
Running test: allterms4... ok
Running test: allterms5... ok
Running test: allterms6... ok
Running test: specialterms1... ok
Running test: specialterms2... ok
Running test: postlist1... ok
Running test: postlist2... ok
Running test: postlist3... ok
Running test: postlist4... ok
Running test: postlist5... ok
Running test: postlist6... ok
Running test: collfreq1... ok
Running test: sortvalue1... ok
Running test: synonym1...
Xapian::Query(date)
Xapian::Query((sky SYNONYM date))
Xapian::Query((date SYNONYM (sky OR glove)))
Xapian::Query((sky SYNONYM date SYNONYM stein SYNONYM ally))
Xapian::Query((sky SYNONYM (date PHRASE 2 stein)))
FAILED
Running test: synonym2... ok
Running test: sortrel1... ok
Running test: matchall1... ok
Running test: docsim1... ok
/home/Tomjon/lemur/xappy/libs/xapian-core/tests/.libs/apitest completed test run: 88 tests passed, 1 failed, 4 skipped.
Running test: matchfunctor1... ok
Running test: matchfunctor2... ok
Running test: matchfunctor3... ok
Running test: consistency1... ok
Running test: userweight1... ok
Running test: sortfunctor1... ok
/home/Tomjon/lemur/xappy/libs/xapian-core/tests/.libs/apitest completed test run: All 6 tests passed.
Running test: near1... ok
Running test: near2... ok
Running test: phrase1... ok
Running test: phrase2... ok
Running test: poslist1... ok
Running test: positfromtermit1... ok
/home/Tomjon/lemur/xappy/libs/xapian-core/tests/.libs/apitest completed test run: All 6 tests passed.
Running tests with backend "quartz"...
Running test: zerodocid1... ok
Running test: emptyquery1... ok
Running test: simplequery1... ok
Running test: simplequery2... ok
Running test: simplequery3... ok
Running test: wildquery1... ok
Running test: multidb1... ok
Running test: msetmaxitems1... ok
Running test: expandweights1... ok
Running test: expandweights2... ok
Running test: expandmaxitems1... ok
Running test: boolquery1... ok
Running test: msetfirst1... ok
Running test: topercent1... ok
Running test: expandfunctor1... ok
Running test: pctcutoff1... ok
Running test: cutoff1... ok
Running test: allowqterms1... ok
Running test: maxattain1... ok
Running test: reversebool1... ok
Running test: reversebool2... ok
Running test: getmterms1... ok
Running test: getmterms2... ok
Running test: poscollapse1... ok
Running test: repeatquery1... ok
Running test: fetchdocs1... ok
Running test: absentterm1... ok
Running test: absentterm2... ok
Running test: rset1... ok
Running test: rset2... ok
Running test: eliteset1... ok
Running test: eliteset2... ok
Running test: eliteset3... ok
Running test: eliteset4... ok
Running test: termlisttermfreq1... ok
Running test: qterminfo1... ok
Running test: qterminfo2... ok
Running test: msetzeroitems1... ok
Running test: matches1... ok
Running test: wqf1... ok
Running test: qlen1... ok
Running test: termlist1... ok
Running test: termlist2... ok
Running test: termlist3... ok
Running test: termlist4... ok
Running test: puncterms1... ok
Running test: spaceterms1... ok
Running test: xor1... ok
Running test: getdoc1... ok
Running test: emptyop1... ok
Running test: checkatleast1... ok
Running test: checkatleast2... ok
Running test: checkatleast3... ok
Running test: allpostlist1... ok
Running test: emptyterm1... ok
Running test: valuerange1... ok
Running test: valuege1... ok
Running test: valuele1... ok
Running test: scaleweight1... ok
Running test: scaleweight2... ok
Running test: bm25weight1... ok
Running test: tradweight1... ok
Running test: termstats... ok
Running test: msetiterator1... ok
Running test: msetiterator2... ok
Running test: msetiterator3... ok
Running test: esetiterator1... ok
Running test: esetiterator2... ok
Running test: collapsekey1... ok
Running test: collapsekey2... SKIPPED
Running test: collapsekey3... ok
Running test: collapsekey4... ok
Running test: allterms1... ok
Running test: allterms2... ok
Running test: allterms3... ok
Running test: allterms4... ok
Running test: allterms5... ok
Running test: allterms6... ok
Running test: specialterms1... ok
Running test: specialterms2... ok
Running test: postlist1... ok
Running test: postlist2... ok
Running test: postlist3... ok
Running test: postlist4... ok
Running test: postlist5... ok
Running test: postlist6... ok
Running test: collfreq1... ok
Running test: sortvalue1... ok
Running test: synonym1...
Xapian::Query(date)
Xapian::Query((sky SYNONYM date))
Xapian::Query((date SYNONYM (sky OR glove)))
Xapian::Query((sky SYNONYM date SYNONYM stein SYNONYM ally))
Xapian::Query((sky SYNONYM (date PHRASE 2 stein)))
FAILED
Running test: synonym2... ok
Running test: sortrel1... ok
Running test: matchall1... ok
Running test: docsim1... ok
/home/Tomjon/lemur/xappy/libs/xapian-core/tests/.libs/apitest completed test run: 91 tests passed, 1 failed, 1 skipped.
Running test: multidb2... ok
Running test: multidb3... ok
Running test: multidb4... ok
Running test: multidb5... ok
Running test: rsetmultidb1... ok
Running test: rsetmultidb3... ok
Running test: rsetmultidb2... ok
Running test: multiexpand1... ok
/home/Tomjon/lemur/xappy/libs/xapian-core/tests/.libs/apitest completed test run: All 8 tests passed.
Running test: matchfunctor1... ok
Running test: matchfunctor2... ok
Running test: matchfunctor3... ok
Running test: consistency1... ok
Running test: userweight1... ok
Running test: sortfunctor1... ok
/home/Tomjon/lemur/xappy/libs/xapian-core/tests/.libs/apitest completed test run: All 6 tests passed.
Running test: near1... ok
Running test: near2... ok
Running test: phrase1... ok
Running test: phrase2... ok
Running test: poslist1... ok
Running test: positfromtermit1... SKIPPED
/home/Tomjon/lemur/xappy/libs/xapian-core/tests/.libs/apitest completed test run: All 5 tests passed, 1 skipped.
Running test: poslist2... ok
Running test: poslist3... ok
/home/Tomjon/lemur/xappy/libs/xapian-core/tests/.libs/apitest completed test run: All 2 tests passed.
Running test: quartzdatabaseopeningerror1... ok
Running test: quartzdatabaseopen1... ok
/home/Tomjon/lemur/xappy/libs/xapian-core/tests/.libs/apitest completed test run: All 2 tests passed.
Running test: badtransaction1... ok
Running test: committransaction1... ok
Running test: canceltransaction1... ok
Running test: canceltransaction2... ok
/home/Tomjon/lemur/xappy/libs/xapian-core/tests/.libs/apitest completed test run: All 4 tests passed.
Running test: adddoc1... ok
Running test: adddoc2... ok
Running test: adddoc3... ok
Running test: adddoc4... ok
Running test: adddoc5... ok
Running test: adddoc6... ok
Running test: implicitendsession1... ok
Running test: databaseassign1... ok
Running test: deldoc1... ok
Running test: deldoc2... ok
Running test: deldoc3... ok
Running test: deldoc4... ok
Running test: deldoc5... ok
Running test: deldoc6... ok
Running test: replacedoc1... ok
Running test: replacedoc2... ok
Running test: replacedoc3... ok
Running test: replacedoc4... ok
Running test: replacedoc5... ok
Running test: uniqueterm1... ok
Running test: allpostlist2... ok
Running test: emptyterm2... ok
Running test: phraseorneartoand1... ok
Running test: longpositionlist1... ok
Running test: crashrecovery1... ok
Running test: nomoredocids1... ok
Running test: synonymitor1... SKIPPED
Running test: matchspy1... ok
Running test: matchspy2... ok
Running test: matchspy3... ok
Running test: metadata1... SKIPPED
Running test: termtoolong1... SKIPPED
Running test: postlist7... ok
/home/Tomjon/lemur/xappy/libs/xapian-core/tests/.libs/apitest completed test run: All 30 tests passed, 3 skipped.
Running test: sortfunctor2... ok
/home/Tomjon/lemur/xappy/libs/xapian-core/tests/.libs/apitest completed test run: All 1 tests passed.
Running tests with backend "remoteprog"...
Running test: zerodocid1... ok
Running test: emptyquery1... ok
Running test: simplequery1... ok
Running test: simplequery2... ok
Running test: simplequery3... ok
Running test: wildquery1... ok
Running test: multidb1... ok
Running test: msetmaxitems1... ok
Running test: expandweights1... ok
Running test: expandweights2... ok
Running test: expandmaxitems1... ok
Running test: boolquery1... ok
Running test: msetfirst1... ok
Running test: topercent1... ok
Running test: expandfunctor1... ok
Running test: pctcutoff1... ok
Running test: cutoff1... ok
Running test: allowqterms1... ok
Running test: maxattain1... ok
Running test: reversebool1... ok
Running test: reversebool2... ok
Running test: getmterms1... ok
Running test: getmterms2... ok
Running test: poscollapse1... ok
Running test: repeatquery1... ok
Running test: fetchdocs1... ok
Running test: absentterm1... ok
Running test: absentterm2... ok
Running test: rset1... ok
Running test: rset2... ok
Running test: eliteset1... ok
Running test: eliteset2... ok
Running test: eliteset3... ok
Running test: eliteset4... ok
Running test: termlisttermfreq1... ok
Running test: qterminfo1... ok
Running test: qterminfo2... ok
Running test: msetzeroitems1... ok
Running test: matches1... ok
Running test: wqf1... ok
Running test: qlen1... ok
Running test: termlist1... ok
Running test: termlist2... ok
Running test: termlist3... ok
Running test: termlist4... ok
Running test: puncterms1... ok
Running test: spaceterms1... ok
Running test: xor1... ok
Running test: getdoc1... ok
Running test: emptyop1... ok
Running test: checkatleast1... ok
Running test: checkatleast2... ok
Running test: checkatleast3... ok
Running test: allpostlist1... ok
Running test: emptyterm1... ok
Running test: valuerange1... ok
Running test: valuege1... ok
Running test: valuele1... ok
Running test: scaleweight1... ok
Running test: scaleweight2... ok
Running test: bm25weight1... ok
Running test: tradweight1... ok
Running test: termstats... ok
Running test: msetiterator1... ok
Running test: msetiterator2... ok
Running test: msetiterator3... ok
Running test: esetiterator1... ok
Running test: esetiterator2... ok
Running test: collapsekey1... ok
Running test: collapsekey2... SKIPPED
Running test: collapsekey3... ok
Running test: collapsekey4... ok
Running test: allterms1... ok
Running test: allterms2... ok
Running test: allterms3... ok
Running test: allterms4... ok
Running test: allterms5... ok
Running test: allterms6... ok
Running test: specialterms1... ok
Running test: specialterms2... ok
Running test: postlist1... ok
Running test: postlist2... ok
Running test: postlist3... ok
Running test: postlist4... ok
Running test: postlist5... ok
Running test: postlist6... ok
Running test: collfreq1... ok
Running test: sortvalue1... ok
Running test: synonym1...
Xapian::Query(date)
Xapian::Query((sky SYNONYM date))
Xapian::Query((date SYNONYM (sky OR glove)))
Xapian::Query((sky SYNONYM date SYNONYM stein SYNONYM ally))
Xapian::Query((sky SYNONYM (date PHRASE 2 stein)))
FAILED
Running test: synonym2... ok
Running test: sortrel1... ok
Running test: matchall1... ok
Running test: docsim1... ok
/home/Tomjon/lemur/xappy/libs/xapian-core/tests/.libs/apitest completed test run: 91 tests passed, 1 failed, 1 skipped.
Running test: multidb2... ok
Running test: multidb3... ok
Running test: multidb4... ok
Running test: multidb5... ok
Running test: rsetmultidb1... ok
Running test: rsetmultidb3... ok
Running test: rsetmultidb2... ok
Running test: multiexpand1... ok
/home/Tomjon/lemur/xappy/libs/xapian-core/tests/.libs/apitest completed test run: All 8 tests passed.
Running test: near1... ok
Running test: near2... ok
Running test: phrase1... ok
Running test: phrase2... ok
Running test: poslist1... ok
Running test: positfromtermit1... SKIPPED
/home/Tomjon/lemur/xappy/libs/xapian-core/tests/.libs/apitest completed test run: All 5 tests passed, 1 skipped.
Running test: poslist2... ok
Running test: poslist3... ok
/home/Tomjon/lemur/xappy/libs/xapian-core/tests/.libs/apitest completed test run: All 2 tests passed.
Running test: keepalive1... ok
Running test: netstats1... ok
/home/Tomjon/lemur/xappy/libs/xapian-core/tests/.libs/apitest completed test run: All 2 tests passed.
Running test: badtransaction1... ok
Running test: committransaction1... ok
Running test: canceltransaction1... ok
Running test: canceltransaction2... ok
/home/Tomjon/lemur/xappy/libs/xapian-core/tests/.libs/apitest completed test run: All 4 tests passed.
Running test: adddoc1... ok
Running test: adddoc2... ok
Running test: adddoc3... ok
Running test: adddoc4... ok
Running test: adddoc5... ok
Running test: adddoc6... ok
Running test: implicitendsession1... ok
Running test: databaseassign1... ok
Running test: deldoc1... ok
Running test: deldoc2... ok
Running test: deldoc3... ok
Running test: deldoc4... ok
Running test: deldoc5... ok
Running test: deldoc6... ok
Running test: replacedoc1... ok
Running test: replacedoc2... ok
Running test: replacedoc3... ok
Running test: replacedoc4... ok
Running test: replacedoc5... ok
Running test: uniqueterm1... ok
Running test: allpostlist2... ok
Running test: emptyterm2... ok
Running test: phraseorneartoand1... ok
Running test: longpositionlist1... ok
Running test: crashrecovery1... SKIPPED
Running test: nomoredocids1... ok
Running test: synonymitor1... SKIPPED
Running test: matchspy1... FAILED
Running test: matchspy2... FAILED
Running test: matchspy3... FAILED
Running test: metadata1... SKIPPED
Running test: termtoolong1... ok
Running test: postlist7... ok
/home/Tomjon/lemur/xappy/libs/xapian-core/tests/.libs/apitest completed test run: 27 tests passed, 3 failed, 3 skipped.
Running tests with backend "remotetcp"...
Running test: zerodocid1... ok
Running test: emptyquery1... ok
Running test: simplequery1... ok
Running test: simplequery2... ok
Running test: simplequery3... ok
Running test: wildquery1... ok
Running test: multidb1... ok
Running test: msetmaxitems1... ok
Running test: expandweights1... ok
Running test: expandweights2... ok
Running test: expandmaxitems1... ok
Running test: boolquery1... ok
Running test: msetfirst1... ok
Running test: topercent1... ok
Running test: expandfunctor1... ok
Running test: pctcutoff1... ok
Running test: cutoff1... ok
Running test: allowqterms1... ok
Running test: maxattain1... ok
Running test: reversebool1... ok
Running test: reversebool2... ok
Running test: getmterms1... ok
Running test: getmterms2... ok
Running test: poscollapse1... ok
Running test: repeatquery1... ok
Running test: fetchdocs1... ok
Running test: absentterm1... ok
Running test: absentterm2... ok
Running test: rset1... ok
Running test: rset2... ok
Running test: eliteset1... ok
Running test: eliteset2... ok
Running test: eliteset3... ok
Running test: eliteset4... ok
Running test: termlisttermfreq1... ok
Running test: qterminfo1... ok
Running test: qterminfo2... ok
Running test: msetzeroitems1... ok
Running test: matches1... ok
Running test: wqf1... ok
Running test: qlen1... ok
Running test: termlist1... ok
Running test: termlist2... ok
Running test: termlist3... ok
Running test: termlist4... ok
Running test: puncterms1... ok
Running test: spaceterms1... ok
Running test: xor1... ok
Running test: getdoc1... ok
Running test: emptyop1... ok
Running test: checkatleast1... ok
Running test: checkatleast2... ok
Running test: checkatleast3... ok
Running test: allpostlist1... ok
Running test: emptyterm1... ok
Running test: valuerange1... ok
Running test: valuege1... ok
Running test: valuele1... ok
Running test: scaleweight1... ok
Running test: scaleweight2... ok
Running test: bm25weight1... ok
Running test: tradweight1... ok
Running test: termstats... ok
Running test: msetiterator1... ok
Running test: msetiterator2... ok
Running test: msetiterator3... ok
Running test: esetiterator1... ok
Running test: esetiterator2... ok
Running test: collapsekey1... ok
Running test: collapsekey2... SKIPPED
Running test: collapsekey3... ok
Running test: collapsekey4... ok
Running test: allterms1... ok
Running test: allterms2... 8882 [main] ? (79588) C:\cygwin\home\Tomjon\lemur\xappy\libs\xapian-core\tests\.libs\apitest.exe: *** fatal error - couldn't allocate heap, Win32 error 487, base 0xBE0000, top 0xC80000, reserve_size 651264, allocsize 655360, page_const 4096
15 [main] apitest 54204 fork: child -1 - died waiting for longjmp before initialization, retry 0, exit code 0x100, errno 11
EXCEPTION: Couldn't fork: Resource temporarily unav...
Running test: allterms3... ok
Running test: allterms4... ok
Running test: allterms5... 7 [main] ? (78392) C:\cygwin\home\Tomjon\lemur\xappy\libs\xapian-core\tests\.libs\apitest.exe: *** fatal error - couldn't allocate heap, Win32 error 487, base 0xBE0000, top 0xC80000, reserve_size 651264, allocsize 655360, page_const 4096
7579164 [main] apitest 54204 fork: child -1 - died waiting for longjmp before initialization, retry 0, exit code 0x100, errno 11
EXCEPTION: Couldn't fork: Resource temporarily unav...
Running test: allterms6... 34 [main] ? (81044) C:\cygwin\home\Tomjon\lemur\xappy\libs\xapian-core\tests\.libs\apitest.exe: *** fatal error - couldn't allocate heap, Win32 error 487, base 0xBE0000, top 0xC80000, reserve_size 651264, allocsize 655360, page_const 4096
23868771 [main] apitest 54204 fork: child -1 - died waiting for longjmp before initialization, retry 0, exit code 0x100, errno 11
EXCEPTION: Couldn't fork: Resource temporarily unav...
Running test: specialterms1... ok
Running test: specialterms2... ok
Running test: postlist1... ok
Running test: postlist2... ok
Running test: postlist3... 6 [main] ? (83840) C:\cygwin\home\Tomjon\lemur\xappy\libs\xapian-core\tests\.libs\apitest.exe: *** fatal error - couldn't allocate heap, Win32 error 487, base 0xBE0000, top 0xC80000, reserve_size 651264, allocsize 655360, page_const 4096
49197865 [main] apitest 54204 fork: child -1 - died waiting for longjmp before initialization, retry 0, exit code 0x100, errno 11
EXCEPTION: Couldn't fork: Resource temporarily unav...
Running test: postlist4... ok
Running test: postlist5... ok
Running test: postlist6... ok
Running test: collfreq1... 8 [main] ? (81788) C:\cygwin\home\Tomjon\lemur\xappy\libs\xapian-core\tests\.libs\apitest.exe: *** fatal error - couldn't allocate heap, Win32 error 487, base 0xBE0000, top 0xC80000, reserve_size 651264, allocsize 655360, page_const 4096
73307501 [main] apitest 54204 fork: child -1 - died waiting for longjmp before initialization, retry 0, exit code 0x100, errno 11
EXCEPTION: Couldn't fork: Resource temporarily unav...
Running test: sortvalue1... ok
Running test: synonym1...
Xapian::Query(date)
Xapian::Query((sky SYNONYM date))
Xapian::Query((date SYNONYM (sky OR glove)))
Xapian::Query((sky SYNONYM date SYNONYM stein SYNONYM ally))
Xapian::Query((sky SYNONYM (date PHRASE 2 stein)))
FAILED
Running test: synonym2... ok
Running test: sortrel1... ok
Running test: matchall1... ok
Running test: docsim1... ok
/home/Tomjon/lemur/xappy/libs/xapian-core/tests/.libs/apitest completed test run: 86 tests passed, 6 failed, 1 skipped.
Running test: multidb2... 9 [main] ? (82188) C:\cygwin\home\Tomjon\lemur\xappy\libs\xapian-core\tests\.libs\apitest.exe: *** fatal error - couldn't allocate heap, Win32 error 487, base 0xBE0000, top 0xC80000, reserve_size 651264, allocsize 655360, page_const 4096
117287154 [main] apitest 54204 fork: child -1 - died waiting for longjmp before initialization, retry 0, exit code 0x100, errno 11
EXCEPTION: Couldn't fork: Resource temporarily unav...
Running test: multidb3... 9 [main] ? (82120) C:\cygwin\home\Tomjon\lemur\xappy\libs\xapian-core\tests\.libs\apitest.exe: *** fatal error - couldn't allocate heap, Win32 error 487, base 0xBE0000, top 0xC80000, reserve_size 651264, allocsize 655360, page_const 4096
135563882 [main] apitest 54204 fork: child -1 - died waiting for longjmp before initialization, retry 0, exit code 0x100, errno 11
EXCEPTION: Couldn't fork: Resource temporarily unav...
Running test: multidb4... 9 [main] ? (84040) C:\cygwin\home\Tomjon\lemur\xappy\libs\xapian-core\tests\.libs\apitest.exe: *** fatal error - couldn't allocate heap, Win32 error 487, base 0xBE0000, top 0xC80000, reserve_size 651264, allocsize 655360, page_const 4096
164761186 [main] apitest 54204 fork: child -1 - died waiting for longjmp before initialization, retry 0, exit code 0x100, errno 11
EXCEPTION: Couldn't fork: Resource temporarily unav...
Running test: multidb5... ok
Running test: rsetmultidb1... 8 [main] ? (85192) C:\cygwin\home\Tomjon\lemur\xappy\libs\xapian-core\tests\.libs\apitest.exe: *** fatal error - couldn't allocate heap, Win32 error 487, base 0xBE0000, top 0xC80000, reserve_size 651264, allocsize 655360, page_const 4096
182145731 [main] apitest 54204 fork: child -1 - died waiting for longjmp before initialization, retry 0, exit code 0x100, errno 11
EXCEPTION: Couldn't fork: Resource temporarily unav...
Running test: rsetmultidb3... ok
Running test: rsetmultidb2... 9 [main] ? (84968) C:\cygwin\home\Tomjon\lemur\xappy\libs\xapian-core\tests\.libs\apitest.exe: *** fatal error - couldn't allocate heap, Win32 error 487, base 0xBE0000, top 0xC80000, reserve_size 651264, allocsize 655360, page_const 4096
198754840 [main] apitest 54204 fork: child -1 - died waiting for longjmp before initialization, retry 0, exit code 0x100, errno 11
EXCEPTION: Couldn't fork: Resource temporarily unav...
Running test: multiexpand1... 9 [main] ? (85676) C:\cygwin\home\Tomjon\lemur\xappy\libs\xapian-core\tests\.libs\apitest.exe: *** fatal error - couldn't allocate heap, Win32 error 487, base 0xBE0000, top 0xC80000, reserve_size 651264, allocsize 655360, page_const 4096
207956558 [main] apitest 54204 fork: child -1 - died waiting for longjmp before initialization, retry 0, exit code 0x100, errno 11
EXCEPTION: Couldn't fork: Resource temporarily unav...
/home/Tomjon/lemur/xappy/libs/xapian-core/tests/.libs/apitest completed test run: 2 tests passed, 6 failed.
Running test: near1... ok
Running test: near2... ok
Running test: phrase1... ok
Running test: phrase2... ok
Running test: poslist1... ok
Running test: positfromtermit1... SKIPPED
/home/Tomjon/lemur/xappy/libs/xapian-core/tests/.libs/apitest completed test run: All 5 tests passed, 1 skipped.
Running test: poslist2... ok
Running test: poslist3... ok
/home/Tomjon/lemur/xappy/libs/xapian-core/tests/.libs/apitest completed test run: All 2 tests passed.
Running test: keepalive1... ok
Running test: netstats1... SIGSEGV
/home/Tomjon/lemur/xappy/libs/xapian-core/tests/.libs/apitest completed test run: 1 tests passed, 1 failed.
Running test: badtransaction1... 9 [main] ? (86680) C:\cygwin\home\Tomjon\lemur\xappy\libs\xapian-core\tests\.libs\apitest.exe: *** fatal error - couldn't allocate heap, Win32 error 487, base 0xBE0000, top 0xC80000, reserve_size 651264, allocsize 655360, page_const 4096
289505231 [main] apitest 54204 fork: child -1 - died waiting for longjmp before initialization, retry 0, exit code 0x100, errno 11
EXCEPTION: Couldn't fork: Resource temporarily unav...
Running test: committransaction1... 9 [main] ? (86924) C:\cygwin\home\Tomjon\lemur\xappy\libs\xapian-core\tests\.libs\apitest.exe: *** fatal error - couldn't allocate heap, Win32 error 487, base 0xBE0000, top 0xC80000, reserve_size 651264, allocsize 655360, page_const 4096
293129920 [main] apitest 54204 fork: child -1 - died waiting for longjmp before initialization, retry 0, exit code 0x100, errno 11
EXCEPTION: Couldn't fork: Resource temporarily unav...
Running test: canceltransaction1... NetworkError
Running test: canceltransaction2... 9 [main] ? (86688) C:\cygwin\home\Tomjon\lemur\xappy\libs\xapian-core\tests\.libs\apitest.exe: *** fatal error - couldn't allocate heap, Win32 error 487, base 0xBE0000, top 0xC80000, reserve_size 651264, allocsize 655360, page_const 4096
308425933 [main] apitest 54204 fork: child -1 - died waiting for longjmp before initialization, retry 0, exit code 0x100, errno 11
EXCEPTION: Couldn't fork: Resource temporarily unav...
/home/Tomjon/lemur/xappy/libs/xapian-core/tests/.libs/apitest completed test run: 0 tests passed, 4 failed.
Running test: adddoc1...rm: cannot remove directory `.flint/dbw': Directory not empty
DatabaseLockError
Running test: adddoc2...rm: cannot remove directory `.flint/dbw': Directory not empty
DatabaseLockError
Running test: adddoc3...rm: cannot remove directory `.flint/dbw': Directory not empty
DatabaseLockError
Running test: adddoc4...rm: cannot remove directory `.flint/dbw': Directory not empty
DatabaseLockError
Running test: adddoc5...rm: cannot remove directory `.flint/dbw': Directory not empty
DatabaseLockError
Running test: adddoc6...rm: cannot remove directory `.flint/dbw': Directory not empty
DatabaseLockError
Running test: implicitendsession1...rm: cannot remove directory `.flint/dbw': Directory not empty
DatabaseLockError
Running test: databaseassign1...rm: cannot remove directory `.flint/dbw': Directory not empty
DatabaseLockError
Running test: deldoc1...rm: cannot remove directory `.flint/dbw': Directory not empty
DatabaseLockError
Running test: deldoc2...rm: cannot remove directory `.flint/dbw': Directory not empty
DatabaseLockError
Running test: deldoc3...rm: cannot remove directory `.flint/dbw': Directory not empty
DatabaseLockError
Running test: deldoc4...rm: cannot remove directory `.flint/dbw': Directory not empty
DatabaseLockError
Running test: deldoc5...rm: cannot remove directory `.flint/dbw': Directory not empty
DatabaseLockError
Running test: deldoc6...rm: cannot remove directory `.flint/dbw': Directory not empty
DatabaseLockError
Running test: replacedoc1...rm: cannot remove directory `.flint/dbw': Directory not empty
DatabaseLockError
Running test: replacedoc2...rm: cannot remove directory `.flint/dbw': Directory not empty
DatabaseLockError
Running test: replacedoc3...rm: cannot remove directory `.flint/dbw': Directory not empty
DatabaseLockError
Running test: replacedoc4...rm: cannot remove directory `.flint/dbw': Directory not empty
DatabaseLockError
Running test: replacedoc5...rm: cannot remove directory `.flint/dbw': Directory not empty
DatabaseLockError
Running test: uniqueterm1...rm: cannot remove directory `.flint/dbw': Directory not empty
DatabaseLockError
Running test: allpostlist2...rm: cannot remove directory `.flint/dbw': Directory not empty
DatabaseLockError
Running test: emptyterm2...rm: cannot remove directory `.flint/dbw': Directory not empty
DatabaseLockError
Running test: phraseorneartoand1...rm: cannot remove directory `.flint/dbw': Directory not empty
DatabaseLockError
Running test: longpositionlist1...rm: cannot remove directory `.flint/dbw': Directory not empty
DatabaseLockError
Running test: crashrecovery1... SKIPPED
Running test: nomoredocids1...rm: cannot remove directory `.flint/dbw': Directory not empty
DatabaseLockError
Running test: synonymitor1... SKIPPED
Running test: matchspy1...rm: cannot remove directory `.flint/dbw': Directory not empty
DatabaseLockError
Running test: matchspy2...rm: cannot remove directory `.flint/dbw': Directory not empty
DatabaseLockError
Running test: matchspy3...rm: cannot remove directory `.flint/dbw': Directory not empty
DatabaseLockError
Running test: metadata1...rm: cannot remove directory `.flint/dbw': Directory not empty
DatabaseLockError
Running test: termtoolong1...rm: cannot remove directory `.flint/dbw': Directory not empty
DatabaseLockError
Running test: postlist7...rm: cannot remove directory `.flint/dbw': Directory not empty
DatabaseLockError
/home/Tomjon/lemur/xappy/libs/xapian-core/tests/.libs/apitest completed test run: 0 tests passed, 31 failed, 2 skipped.
/home/Tomjon/lemur/xappy/libs/xapian-core/tests/.libs/apitest total: 819 tests passed, 56 failed, 26 skipped.
FAIL: apitest.exe
Running test: except1... ok
Running test: exception1... ok
Running test: refcnt1... ok
Running test: refcnt2... ok
Running test: autoptr1... ok
Running test: stringcomp1... ok
Running test: temporarydtor1... ok
Running test: tostring1... ok
Running test: serialisedouble1... ok
Running test: serialiselength1... ok
Running test: serialiselength2... ok
Running test: serialisedoc1... ok
Running test: serialisequery1... ok
Running test: serialiseerror1... ok
/home/Tomjon/lemur/xappy/libs/xapian-core/tests/.libs/internaltest completed test run: All 14 tests passed.
PASS: internaltest.exe
The random seed is 42
Please report the seed when reporting a test failure.
Running tests with danish stemmer...
Running test: stemrandom... ok
Running test: stemjunk... ok
Running test: stemdict... SKIPPED
/home/Tomjon/lemur/xappy/libs/xapian-core/tests/.libs/stemtest completed test run: All 2 tests passed, 1 skipped.
Running tests with dutch stemmer...
Running test: stemrandom... ok
Running test: stemjunk... ok
Running test: stemdict... SKIPPED
/home/Tomjon/lemur/xappy/libs/xapian-core/tests/.libs/stemtest completed test run: All 2 tests passed, 1 skipped.
Running tests with english stemmer...
Running test: stemrandom... ok
Running test: stemjunk... ok
Running test: stemdict... SKIPPED
/home/Tomjon/lemur/xappy/libs/xapian-core/tests/.libs/stemtest completed test run: All 2 tests passed, 1 skipped.
Running tests with finnish stemmer...
Running test: stemrandom... ok
Running test: stemjunk... ok
Running test: stemdict... SKIPPED
/home/Tomjon/lemur/xappy/libs/xapian-core/tests/.libs/stemtest completed test run: All 2 tests passed, 1 skipped.
Running tests with french stemmer...
Running test: stemrandom... ok
Running test: stemjunk... ok
Running test: stemdict... SKIPPED
/home/Tomjon/lemur/xappy/libs/xapian-core/tests/.libs/stemtest completed test run: All 2 tests passed, 1 skipped.
Running tests with german stemmer...
Running test: stemrandom... ok
Running test: stemjunk... ok
Running test: stemdict... SKIPPED
/home/Tomjon/lemur/xappy/libs/xapian-core/tests/.libs/stemtest completed test run: All 2 tests passed, 1 skipped.
Running tests with german2 stemmer...
Running test: stemrandom... ok
Running test: stemjunk... ok
Running test: stemdict... SKIPPED
/home/Tomjon/lemur/xappy/libs/xapian-core/tests/.libs/stemtest completed test run: All 2 tests passed, 1 skipped.
Running tests with hungarian stemmer...
Running test: stemrandom... ok
Running test: stemjunk... ok
Running test: stemdict... SKIPPED
/home/Tomjon/lemur/xappy/libs/xapian-core/tests/.libs/stemtest completed test run: All 2 tests passed, 1 skipped.
Running tests with italian stemmer...
Running test: stemrandom... ok
Running test: stemjunk... ok
Running test: stemdict... SKIPPED
/home/Tomjon/lemur/xappy/libs/xapian-core/tests/.libs/stemtest completed test run: All 2 tests passed, 1 skipped.
Running tests with kraaij_pohlmann stemmer...
Running test: stemrandom... ok
Running test: stemjunk... ok
Running test: stemdict... SKIPPED
/home/Tomjon/lemur/xappy/libs/xapian-core/tests/.libs/stemtest completed test run: All 2 tests passed, 1 skipped.
Running tests with lovins stemmer...
Running test: stemrandom... ok
Running test: stemjunk... ok
Running test: stemdict... SKIPPED
/home/Tomjon/lemur/xappy/libs/xapian-core/tests/.libs/stemtest completed test run: All 2 tests passed, 1 skipped.
Running tests with norwegian stemmer...
Running test: stemrandom... ok
Running test: stemjunk... ok
Running test: stemdict... SKIPPED
/home/Tomjon/lemur/xappy/libs/xapian-core/tests/.libs/stemtest completed test run: All 2 tests passed, 1 skipped.
Running tests with porter stemmer...
Running test: stemrandom... ok
Running test: stemjunk... ok
Running test: stemdict... SKIPPED
/home/Tomjon/lemur/xappy/libs/xapian-core/tests/.libs/stemtest completed test run: All 2 tests passed, 1 skipped.
Running tests with portuguese stemmer...
Running test: stemrandom... ok
Running test: stemjunk... ok
Running test: stemdict... SKIPPED
/home/Tomjon/lemur/xappy/libs/xapian-core/tests/.libs/stemtest completed test run: All 2 tests passed, 1 skipped.
Running tests with romanian stemmer...
Running test: stemrandom... ok
Running test: stemjunk... ok
Running test: stemdict... SKIPPED
/home/Tomjon/lemur/xappy/libs/xapian-core/tests/.libs/stemtest completed test run: All 2 tests passed, 1 skipped.
Running tests with russian stemmer...
Running test: stemrandom... ok
Running test: stemjunk... ok
Running test: stemdict... SKIPPED
/home/Tomjon/lemur/xappy/libs/xapian-core/tests/.libs/stemtest completed test run: All 2 tests passed, 1 skipped.
Running tests with spanish stemmer...
Running test: stemrandom... ok
Running test: stemjunk... ok
Running test: stemdict... SKIPPED
/home/Tomjon/lemur/xappy/libs/xapian-core/tests/.libs/stemtest completed test run: All 2 tests passed, 1 skipped.
Running tests with swedish stemmer...
Running test: stemrandom... ok
Running test: stemjunk... ok
Running test: stemdict... SKIPPED
/home/Tomjon/lemur/xappy/libs/xapian-core/tests/.libs/stemtest completed test run: All 2 tests passed, 1 skipped.
Running tests with turkish stemmer...
Running test: stemrandom... ok
Running test: stemjunk... ok
Running test: stemdict... SKIPPED
/home/Tomjon/lemur/xappy/libs/xapian-core/tests/.libs/stemtest completed test run: All 2 tests passed, 1 skipped.
/home/Tomjon/lemur/xappy/libs/xapian-core/tests/.libs/stemtest total: All 38 tests passed, 19 skipped.
PASS: stemtest.exe
Running test: queryparser1... ok
Running test: qp_default_op1... ok
Running test: qp_odd_chars1... ok
Running test: qp_flag_wildcard1... ok
Running test: qp_flag_wildcard2... ok
Running test: qp_flag_partial1... ok
Running test: qp_flag_bool_any_case1... ok
Running test: qp_stopper1... ok
Running test: qp_flag_pure_not1... ok
Running test: qp_unstem_boolean_prefix... ok
Running test: qp_default_prefix1... ok
Running test: qp_default_prefix2... ok
Running test: value_range_serialise1... ok
Running test: qp_value_range1... ok
Running test: qp_value_range2... ok
Running test: qp_value_range3... ok
Running test: qp_value_daterange1... ok
Running test: qp_value_customrange1... ok
Running test: qp_stoplist1... ok
Running test: qp_spell1... ok
Running test: qp_spell2... ok
Running test: qp_synonym1... ok
Running test: qp_synonym2... ok
Running test: qp_synonym3... ok
Running test: qp_stem_all1... ok
/home/Tomjon/lemur/xappy/libs/xapian-core/tests/.libs/queryparsertest completed test run: All 25 tests passed.
PASS: queryparsertest.exe
Running test: termgen1... ok
Running test: tg_spell1... ok
Running test: tg_spell2... ok
/home/Tomjon/lemur/xappy/libs/xapian-core/tests/.libs/termgentest completed test run: All 3 tests passed.
PASS: termgentest.exe
===================
1 of 7 tests failed
===================
make[4]: *** [check-TESTS] Error 1
make[4]: Leaving directory `/home/Tomjon/lemur/xappy/libs/xapian-core/tests'
make[3]: *** [check-am] Error 2
make[3]: Leaving directory `/home/Tomjon/lemur/xappy/libs/xapian-core/tests'
make[2]: *** [check] Error 2
make[2]: Leaving directory `/home/Tomjon/lemur/xappy/libs/xapian-core/tests'
make[1]: *** [check-recursive] Error 1
make[1]: Leaving directory `/home/Tomjon/lemur/xappy/libs/xapian-core'
make: *** [check] Error 2