nclude/kio/netaccess.h:347)
Making all in galleryexport
Making all in flickrexport
Making all in kameraklient
gpcamera.cpp: In static member function 'static int KIPIKameraKlientPlugin::GPCamera::autoDetect(QString&, QString&)':
gpcamera.cpp:564: error: aggregate 'CameraList camList' has incomplete type and cannot be defined
make[3]: *** [gpcamera.lo] Error 1
make[3]: *** Waiting for unfinished jobs....
make[2]: *** [all-recursive] Error 1
make[1]: *** [all-recursive] Error 1
make: *** [all] Error 2
*
* ERROR: media-plugins/kipi-plugins-0.1.0_rc1 failed.
* Call stack:
* ebuild.sh, line 49: Called src_compile
* environment, line 4150: Called kde_src_compile 'src_compile'
* environment, line 2997: Called kde_src_compile 'src_compile' 'all' 'myconf'
* environment, line 2993: Called die
* The specific snippet of code:
* emake || die "died running emake, $FUNCNAME:make"
* The die message:
* died running emake, kde_src_compile:make
*
* If you need support, post the topmost build error, and the call stack if relevant.
* A complete build log is located at '/var/tmp/portage/media-plugins/kipi-plugins-0.1.0_rc1/temp/build.log'.
* The ebuild environment file is located at '/var/tmp/portage/media-plugins/kipi-plugins-0.1.0_rc1/temp/environment'.
*
* Messages for package media-plugins/kipi-plugins-0.1.0_rc1:
*
* ERROR: media-plugins/kipi-plugins-0.1.0_rc1 failed.
* Call stack:
* ebuild.sh, line 49: Called src_compile
* environment, line 4150: Called kde_src_compile 'src_compile'
* environment, line 2997: Called kde_src_compile 'src_compile' 'all' 'myconf'
* environment, line 2993: Called die
* The specific snippet of code:
* emake || die "died running emake, $FUNCNAME:make"
* The die message:
* died running emake, kde_src_compile:make
*
* If you need support, post the topmost build error, and the call stack if relevant.
* A complete build log is located at '/var/tmp/portage/media-plugins/kipi-plugins-0.1.0_rc1/temp/build.log'.
* The ebuild environment file is located at '/var/tmp/portage/media-plugins/kipi-plugins-0.1.0_rc1/temp/environment'.
*
revdep-rebuild failed to emerge all packages
you have the following choices:
- if emerge failed during the build, fix the problems and re-run revdep-rebuild
or
- use -X or --package-names as first argument (trys to rebuild package, not exact
ebuild)
or
- set ACCEPT_KEYWORDS="~<your platform>" and/or /etc/portage/package.unmask
(and remove /root/.revdep-rebuild.5_order to be evaluated again)
or
- modify the above emerge command and run it manually
or
- compile or unmerge unsatisfied packages manually, remove temporary files and
try again (you can edit package/ebuild list first)
To remove temporary files, please run:
rm /root/.revdep-rebuild*.?_*