All pastes #92909 Raw Edit

pscott

public text v1 · immutable
#92909 ·published 2006-07-20 00:57 UTC
rendered paste body
...
test -z "/usr/lib/boo" || mkdir -p -- "/tmp/rmake/builds/boo/_ROOT_/usr/lib/boo"
 /usr/bin/install -c -m 644 'booc.exe' '/tmp/rmake/builds/boo/_ROOT_/usr/lib/boo/booc.exe'
 /usr/bin/install -c -m 644 'booi.exe' '/tmp/rmake/builds/boo/_ROOT_/usr/lib/boo/booi.exe'
 /usr/bin/install -c -m 644 'booish.exe' '/tmp/rmake/builds/boo/_ROOT_/usr/lib/boo/booish.exe'
 /usr/bin/install -c -m 644 'booc.rsp' '/tmp/rmake/builds/boo/_ROOT_/usr/lib/boo/booc.rsp'
 /usr/bin/install -c -m 644 'booc.exe.config' '/tmp/rmake/builds/boo/_ROOT_/usr/lib/boo/booc.exe.config'
 /usr/bin/install -c -m 644 'booi.exe.config' '/tmp/rmake/builds/boo/_ROOT_/usr/lib/boo/booi.exe.config'
 /usr/bin/install -c -m 644 'booish.exe.config' '/tmp/rmake/builds/boo/_ROOT_/usr/lib/boo/booish.exe.config'
make  install-data-hook
make[3]: Entering directory `/tmp/rmake/builds/boo/boo-0.7.6.2234/bin'
for lib in Boo.Lang.dll Boo.Lang.Useful.dll Boo.Lang.Compiler.dll Boo.Lang.Parser.dll Boo.Lang.Interpreter.dll Boo.Lang.CodeDom.dll; do       \        echo "/usr/bin/gacutil /i ${lib} /package boo /gacdir /tmp/rmake/builds/boo/_ROOT_//usr/lib" ;  \
        /usr/bin/gacutil /i ${lib} /package boo /gacdir /tmp/rmake/builds/boo/_ROOT_//usr/lib || exit 1 ;       \
done
/usr/bin/gacutil /i Boo.Lang.dll /package boo /gacdir /tmp/rmake/builds/boo/_ROOT_//usr/lib

** (/usr/lib/mono/1.0/gacutil.exe:7039): CRITICAL **: _wapi_shm_file_open: shared file [/.wapi/shared_data-grond.local-Linux-i686-308-10-0] open error: No such file or directory

** (/usr/lib/mono/1.0/gacutil.exe:7039): CRITICAL **: _wapi_shm_attach: shared file [/.wapi/shared_data-grond.local-Linux-i686-308-10-0] open error

** ERROR **: file shared.c: line 310 (_wapi_shm_semaphores_init): assertion failed: (tmp_shared != NULL)
aborting...

=================================================================
Got a SIGABRT while executing native code. This usually indicates
a fatal error in the mono runtime or one of the native libraries
used by your application.
=================================================================

Stacktrace:


Native stacktrace:

        /usr/bin/mono(mono_handle_native_sigsegv+0xf4) [0x8161254]
        [0xffffe440]
        /lib/tls/libc.so.6(abort+0xe9) [0xb7d08a59]
        /usr/lib/libglib-2.0.so.0 [0xb7e896a5]
        /usr/lib/libglib-2.0.so.0(g_log+0x26) [0xb7e896d6]
        /usr/lib/libglib-2.0.so.0(g_assert_warning+0x79) [0xb7e89a69]
        /usr/bin/mono [0x80fbbb4]
        /usr/bin/mono [0x81078a2]
        /usr/bin/mono(mono_once+0xd5) [0x8105445]
        /usr/bin/mono [0x8107d7f]
        /usr/bin/mono [0x80fe161]
        /usr/bin/mono(mono_thread_pool_init+0x94) [0x80a2da4]
        /usr/bin/mono(mono_runtime_init+0x21) [0x809d871]
        /usr/bin/mono [0x814c3fb]
        /usr/bin/mono(mono_main+0x1d9) [0x805c5a9]
        /usr/bin/mono [0x805bf1e]
        /lib/tls/libc.so.6(__libc_start_main+0xcf) [0xb7cf423f]
        /usr/bin/mono [0x805be71]
/bin/sh: line 1:  7039 Aborted                 /usr/bin/gacutil /i ${lib} /package boo /gacdir /tmp/rmake/builds/boo/_ROOT_//usr/lib
make[3]: *** [install-data-hook] Error 1
make[3]: Leaving directory `/tmp/rmake/builds/boo/boo-0.7.6.2234/bin'
make[2]: *** [install-data-am] Error 2
make[2]: Leaving directory `/tmp/rmake/builds/boo/boo-0.7.6.2234/bin'
make[1]: *** [install-am] Error 2
make[1]: Leaving directory `/tmp/rmake/builds/boo/boo-0.7.6.2234/bin'
make: *** [install-recursive] Error 1
error: Shell command "cd /tmp/rmake/builds/boo/boo-0.7.6.2234/; CFLAGS="-O2 -march=i686 -g" CXXFLAGS="-O2 -march=i686 -g " CPPFLAGS="" CLASSPATH=""  LDFLAGS="-g" CC=gcc CXX=g++  make   DESTDIR=/tmp/rmake/builds/boo/_ROOT_ install " exited with exit code 2
error: Error building recipe boo:source=/contrib.rpath.org@rpl:devel/0.7.6_2234-1[is: x86(~3dnow,~3dnowext,~cmov,~i486,~i586,~i686,~mmx,~mmxext,~sse)]: Shell command "cd /tmp/rmake/builds/boo/boo-0.7.6.2234/; CFLAGS="-O2 -march=i686 -g" CXXFLAGS="-O2 -march=i686 -g " CPPFLAGS="" CLASSPATH=""  LDFLAGS="-g" CC=gcc CXX=g++  make   DESTDIR=/tmp/rmake/builds/boo/_ROOT_ install " exited with exit code 2

[paul@grond boo]$