All pastes #923767 Raw Edit

Miscellany

public text v1 · immutable
#923767 ·published 2008-02-29 21:07 UTC
rendered paste body
localhost khronus # revdep-rebuild
Configuring search environment for revdep-rebuild

Checking reverse dependencies...

Packages containing binaries and libraries broken by a package update
will be emerged.

Collecting system binaries and libraries... done.
  (/root/.revdep-rebuild.1_files)

Collecting complete LD_LIBRARY_PATH... done.
  (/root/.revdep-rebuild.2_ldpath)

Checking dynamic linking consistency...
  broken /usr/bin/ink (requires  libinklevel.so.2)
 done.
  (/root/.revdep-rebuild.3_rebuild)

Assigning files to ebuilds... done.
  (/root/.revdep-rebuild.4_ebuilds)

Evaluating package order... done.
  (/root/.revdep-rebuild.5_order)

All prepared. Starting rebuild...
emerge --oneshot  =net-print/ink-0.3 
..........
Calculating dependencies... done!
>>> Verifying ebuild Manifests...

>>> Emerging (1 of 1) net-print/ink-0.3 to /
 * ink-0.3.tar.gz RMD160 SHA1 SHA256 size ;-) ...                         [ ok ]
 * checking ebuild checksums ;-) ...                                      [ ok ]
 * checking auxfile checksums ;-) ...                                     [ ok ]
 * checking miscfile checksums ;-) ...                                    [ ok ]
 * checking ink-0.3.tar.gz ;-) ...                                        [ ok ]
>>> Unpacking source...
>>> Unpacking ink-0.3.tar.gz to /var/tmp/portage/net-print/ink-0.3/work
>>> Source unpacked.
>>> Compiling source in /var/tmp/portage/net-print/ink-0.3/work/ink ...
cc -Wall -O -linklevel    ink.c   -o ink
ink.c: In function 'main':
ink.c:66: warning: passing argument 2 of 'get_ink_level' makes pointer from integer without a cast
ink.c:66: warning: passing argument 3 of 'get_ink_level' makes integer from pointer without a cast
ink.c:66: error: too few arguments to function 'get_ink_level'
ink.c:117: error: 'struct ink_level' has no member named 'type'
ink.c:121: error: 'ONE_COLOR_FOUND' undeclared (first use in this function)
ink.c:121: error: (Each undeclared identifier is reported only once
ink.c:121: error: for each function it appears in.)
ink.c:122: error: 'struct ink_level' has no member named 'color'
ink.c:124: error: 'ONE_BLACK_COLOR_FOUND' undeclared (first use in this function)
ink.c:125: error: 'struct ink_level' has no member named 'black'
ink.c:127: error: 'TWO_COLORS_FOUND' undeclared (first use in this function)
ink.c:128: error: 'struct ink_level' has no member named 'black'
ink.c:129: error: 'struct ink_level' has no member named 'color'
ink.c:131: error: 'TWO_PHOTO_COLORS_FOUND' undeclared (first use in this function)
ink.c:132: error: 'struct ink_level' has no member named 'photo'
ink.c:133: error: 'struct ink_level' has no member named 'color'
ink.c:135: error: 'THREE_COLORS_FOUND' undeclared (first use in this function)
ink.c:136: error: 'struct ink_level' has no member named 'cyan'
ink.c:137: error: 'struct ink_level' has no member named 'magenta'
ink.c:138: error: 'struct ink_level' has no member named 'yellow'
ink.c:140: error: 'FOUR_COLORS_FOUND' undeclared (first use in this function)
ink.c:141: error: 'struct ink_level' has no member named 'black'
ink.c:142: error: 'struct ink_level' has no member named 'cyan'
ink.c:143: error: 'struct ink_level' has no member named 'magenta'
ink.c:144: error: 'struct ink_level' has no member named 'yellow'
ink.c:146: error: 'SIX_COLORS_FOUND' undeclared (first use in this function)
ink.c:147: error: 'struct ink_level' has no member named 'black'
ink.c:148: error: 'struct ink_level' has no member named 'cyan'
ink.c:149: error: 'struct ink_level' has no member named 'magenta'
ink.c:150: error: 'struct ink_level' has no member named 'yellow'
ink.c:151: error: 'struct ink_level' has no member named 'photocyan'
ink.c:152: error: 'struct ink_level' has no member named 'photomagenta'
ink.c:154: error: 'SEVEN_COLORS_FOUND' undeclared (first use in this function)
ink.c:155: error: 'struct ink_level' has no member named 'black'
ink.c:156: error: 'struct ink_level' has no member named 'cyan'
ink.c:157: error: 'struct ink_level' has no member named 'magenta'
ink.c:158: error: 'struct ink_level' has no member named 'yellow'
ink.c:159: error: 'struct ink_level' has no member named 'photocyan'
ink.c:160: error: 'struct ink_level' has no member named 'photomagenta'
ink.c:161: error: 'struct ink_level' has no member named 'photoyellow'
make: *** [ink] Error 1
 * 
 * ERROR: net-print/ink-0.3 failed.
 * Call stack:
 *               ebuild.sh, line   49:  Called src_compile
 *             environment, line  168:  Called die
 * The specific snippet of code:
 *           emake || die "emake failed";
 *  The die message:
 *   emake failed
 * 
 * If you need support, post the topmost build error, and the call stack if relevant.
 * A complete build log is located at '/var/tmp/portage/net-print/ink-0.3/temp/build.log'.
 * The ebuild environment file is located at '/var/tmp/portage/net-print/ink-0.3/temp/environment'.
 * 

 * Messages for package net-print/ink-0.3:

 * 
 * ERROR: net-print/ink-0.3 failed.
 * Call stack:
 *               ebuild.sh, line   49:  Called src_compile
 *             environment, line  168:  Called die
 * The specific snippet of code:
 *           emake || die "emake failed";
 *  The die message:
 *   emake failed
 * 
 * If you need support, post the topmost build error, and the call stack if relevant.
 * A complete build log is located at '/var/tmp/portage/net-print/ink-0.3/temp/build.log'.
 * The ebuild environment file is located at '/var/tmp/portage/net-print/ink-0.3/temp/environment'.
 * 

revdep-rebuild failed to emerge all packages
you have the following choices:

- if emerge failed during the build, fix the problems and re-run revdep-rebuild
    or
- use -X or --package-names as first argument (trys to rebuild package, not exact
  ebuild)
    or
- set ACCEPT_KEYWORDS="~<your platform>" and/or /etc/portage/package.unmask
  (and remove /root/.revdep-rebuild.5_order to be evaluated again)
    or
- modify the above emerge command and run it manually
    or
- compile or unmerge unsatisfied packages manually, remove temporary files and
  try again (you can edit package/ebuild list first)

To remove temporary files, please run:
rm /root/.revdep-rebuild*.?_*
localhost khronus #