All pastes #923711 Raw Edit

Stuff

public text v1 · immutable
#923711 ·published 2008-02-29 19:59 UTC
rendered paste body
lude -I../../../include -D_FILE_OFFSET_BITS=64 -D__USE_UNIX98 -D_LARGEFILE64_SOURCE -D_REENTRANT -D_THREAD_SAFE -DLOCALEDIR=\"/usr/share/locale\" -DDATA_PATH=\"/usr/share/vlc\" -DPLUGIN_PATH=\"/usr/lib/vlc\" -D__LIBVLC__ -D__PLUGIN__ -Imodules/gui/skins2 -DX11_SKINS -DMODULE_NAME=skins2 -DMODULE_NAME_IS_skins2 -O0 -O2 -fno-rtti -Os -march=i686 -MT libskins2_plugin_la-expr_evaluator.lo -MD -MP -MF .deps/libskins2_plugin_la-expr_evaluator.Tpo -c parser/expr_evaluator.cpp  -fPIC -DPIC -o .libs/libskins2_plugin_la-expr_evaluator.o
In file included from parser/../src/ft2_font.hpp:28,
                 from parser/builder.cpp:35:
/usr/include/ft2build.h:56:38: error: freetype/config/ftheader.h: No such file or directory
In file included from parser/builder.cpp:35:
parser/../src/ft2_font.hpp:29:10: error: #include expects "FILENAME" or <FILENAME>
parser/../src/ft2_font.hpp:30:10: error: #include expects "FILENAME" or <FILENAME>
In file included from parser/builder.cpp:35:
parser/../src/ft2_font.hpp:60: error: 'FT_Glyph' does not name a type
parser/../src/ft2_font.hpp:61: error: 'FT_BBox' does not name a type
parser/../src/ft2_font.hpp:74: error: 'FT_Library' does not name a type
parser/../src/ft2_font.hpp:76: error: 'FT_Face' does not name a type
 i586-pc-linux-gnu-g++ -DHAVE_CONFIG_H -I. -I../../.. -DSYS_LINUX -I../../../include -I../../../include -D_FILE_OFFSET_BITS=64 -D__USE_UNIX98 -D_LARGEFILE64_SOURCE -D_REENTRANT -D_THREAD_SAFE -DLOCALEDIR=\"/usr/share/locale\" -DDATA_PATH=\"/usr/share/vlc\" -DPLUGIN_PATH=\"/usr/lib/vlc\" -D__LIBVLC__ -D__PLUGIN__ -Imodules/gui/skins2 -DX11_SKINS -DMODULE_NAME=skins2 -DMODULE_NAME_IS_skins2 -O0 -O2 -fno-rtti -Os -march=i686 -MT libskins2_plugin_la-interpreter.lo -MD -MP -MF .deps/libskins2_plugin_la-interpreter.Tpo -c parser/interpreter.cpp  -fPIC -DPIC -o .libs/libskins2_plugin_la-interpreter.o
make[6]: *** [libskins2_plugin_la-builder.lo] Error 1
make[6]: *** Waiting for unfinished jobs....
make[5]: *** [all-modules] Error 1
make[4]: *** [all-recursive] Error 1
make[3]: *** [all] Error 2
make[2]: *** [all-recursive] Error 1
make[1]: *** [all-recursive] Error 1
make: *** [all] Error 2
 *
 * ERROR: media-video/vlc-0.9.0_alpha20080128 failed.
 * Call stack:
 *               ebuild.sh, line   49:  Called src_compile
 *             environment, line 3944:  Called die
 * The specific snippet of code:
 *       emake || die "make of VLC failed"
 *  The die message:
 *   make of VLC failed
 *
 * If you need support, post the topmost build error, and the call stack if relevant.
 * A complete build log is located at '/var/lib/entropy/logs/media-video:vlc-0.9.0_alpha20080128:20080229-100744.log'.
 * The ebuild environment file is located at '/var/tmp/portage/media-video/vlc-0.9.0_alpha20080128/temp/environment'.
 *
 * Regenerating GNU info directory index...
 *
 * revdep-rebuild failed to emerge all packages.
 * you have the following choices:
 * - If emerge failed during the build, fix the problems and re-run revdep-rebuild.
 * - Use /etc/portage/package.keywords to unmask a newer version of the package.
 *   (and remove /root/.revdep-rebuild.5_order to be evaluated again)
 * - Modify the above emerge command and run it manually.
 * - Compile or unmerge unsatisfied packages manually,
 *   remove temporary files, and try again.
 *   (you can edit package/ebuild list first)
 *
 * To remove temporary files, please run:
 * rm /root/.revdep-rebuild*.?_*
localhost didkoddd #