All pastes #923612 Raw Edit

Someone

public text v1 · immutable
#923612 ·published 2008-02-29 18:24 UTC
rendered paste body
wget ftp://ftp.alsa-project.org/pub/driver/alsa-driver-1.0.16rc1.tar.bz2
tar xvpjf alsa-driver-1.0.16rc1.tar.bz2
cd alsa-driver-1.0.16rc1
./configure --with-cards=hda-intel

In file included from /home/yeonhoo/Desktop/alsa-driver-1.0.16rc1/acore/../alsa-
kernel/core/info_oss.c:29,
                 from /home/yeonhoo/Desktop/alsa-driver-1.0.16rc1/acore/info_oss
.c:7:
include/linux/utsname.h:76:52: error: macro "init_utsname" passed 1 arguments, b
ut takes just 0
In file included from /home/yeonhoo/Desktop/alsa-driver-1.0.16rc1/acore/../alsa-
kernel/core/info_oss.c:29,
                 from /home/yeonhoo/Desktop/alsa-driver-1.0.16rc1/acore/info_oss
.c:7:
include/linux/utsname.h:77: error: expected ‘=’, ‘,’, ‘;’, ‘asm’ or ‘__attribute
__’ before ‘{’ token
In file included from /home/yeonhoo/Desktop/alsa-driver-1.0.16rc1/acore/info_oss
.c:7:
/home/yeonhoo/Desktop/alsa-driver-1.0.16rc1/acore/../alsa-kernel/core/info_oss.c
: In function ‘snd_sndstat_proc_read’:
/home/yeonhoo/Desktop/alsa-driver-1.0.16rc1/acore/../alsa-kernel/core/info_oss.c
:96: error: ‘system_utsname’ undeclared (first use in this function)
/home/yeonhoo/Desktop/alsa-driver-1.0.16rc1/acore/../alsa-kernel/core/info_oss.c
:96: error: (Each undeclared identifier is reported only once
/home/yeonhoo/Desktop/alsa-driver-1.0.16rc1/acore/../alsa-kernel/core/info_oss.c
:96: error: for each function it appears in.)
make[3]: *** [/home/yeonhoo/Desktop/alsa-driver-1.0.16rc1/acore/info_oss.o] Erro
r 1
make[2]: *** [/home/yeonhoo/Desktop/alsa-driver-1.0.16rc1/acore] Error 2
make[1]: *** [_module_/home/yeonhoo/Desktop/alsa-driver-1.0.16rc1] Error 2
make[1]: Leaving directory `/usr/src/linux-headers-2.6.22-14-generic'
make: *** [compile] Error 2