rendered paste body if test "$ret" = 0; then echo '#include "keygenwizard2.moc"' >> keygenwizard2.cc; else rm -f keygenwizard2.cc ; exit $ret ; fi
creating libkssl_la.all_cc.cc ...
/bin/sh ../../libtool --silent --tag=CXX --mode=compile g++ -DHAVE_CONFIG_H -I. -I../.. -I../../dcop -I../../kdecore -I../../kjs -I../../kdecore/network -I../../kwallet/client -I../../dcop -I../../libltdl -I../../kdefx -I../../kdecore -I../../kdecore -I../../kdecore/network -I../../kdeui -I../../kio -I../../kio/kio -I../../kio/kfile -I../.. -I/usr/lib64/qt-3.3/include -I. -I/usr/include/kde -DQT_THREAD_SUPPORT -D_REENTRANT -DNDEBUG -DNO_DEBUG -O2 -O2 -g -pipe -Wall -Wp,-D_FORTIFY_SOURCE=2 -fexceptions -fstack-protector --param=ssp-buffer-size=4 -m64 -mtune=generic -fno-exceptions -fno-check-new -fno-common -DQT_CLEAN_NAMESPACE -DQT_NO_ASCII_CAST -DQT_NO_STL -DQT_NO_COMPAT -DQT_NO_TRANSLATION -c -o libkssl_la.all_cc.lo libkssl_la.all_cc.cc
In file included from libkssl_la.all_cc.cc:14:
ksslpkcs12.cc:47:27: error: uiserver_stub.h: No such file or directory
ksslcertificatehome.cc: In function 'QStringList getEngineCerts()':
ksslcertificatehome.cc:48: error: cannot convert 'QString' to 'const char*' in initialization
kopenssl.cc: In destructor 'KOpenSSLProxy::~KOpenSSLProxy()':
kopenssl.cc:702: warning: 'setObject' is deprecated (declared at ../../kdecore/kstaticdeleter.h:85)
ksslpkcs12.cc: In constructor 'KSSLPKCS12Private::KSSLPKCS12Private()':
ksslpkcs12.cc:57: warning: 'KSSLPKCS12Private::eng' will be initialized after
ksslpkcs12.cc:56: warning: 'QString KSSLPKCS12Private::slot_id'
ksslpkcs12.cc:55: warning: when initialized here
ksslpkcs12.cc: At global scope:
ksslpkcs12.cc:92: error: 'KIO' has not been declared
ksslpkcs12.cc:92: error: 'info' was not declared in this scope
ksslpkcs12.cc:92: error: expected ',' or ';' before '{' token
kopenssl.cc:207: warning: 'K_ENGINE_load_builtin_engines' defined but not used
ksslpkcs12.cc:90: warning: 's_seqNr' defined but not used
make[5]: *** [libkssl_la.all_cc.lo] Error 1
make[5]: Leaving directory `/home/tuju/PKGS/BUILD/kdelibs-3.5.8/kio/kssl'
make[4]: *** [all-recursive] Error 1
make[4]: Leaving directory `/home/tuju/PKGS/BUILD/kdelibs-3.5.8/kio/kssl'
make[3]: *** [all] Error 2
make[3]: Leaving directory `/home/tuju/PKGS/BUILD/kdelibs-3.5.8/kio/kssl'
make[2]: *** [all-recursive] Error 1
make[2]: Leaving directory `/home/tuju/PKGS/BUILD/kdelibs-3.5.8/kio'
make[1]: *** [all-recursive] Error 1
make[1]: Leaving directory `/home/tuju/PKGS/BUILD/kdelibs-3.5.8'
make: *** [all] Error 2
error: Bad exit status from /var/tmp/rpm-tmp.3546 (%build)