All pastes #923454 Raw Edit

Someone

public text v1 · immutable
#923454 ·published 2008-02-29 15:56 UTC
rendered paste body
bash-3.00# gdb gmake
GNU gdb 6.6
Copyright (C) 2006 Free Software Foundation, Inc.
GDB is free software, covered by the GNU General Public License, and you are
welcome to change it and/or distribute copies of it under certain conditions.
Type "show copying" to see the conditions.
There is absolutely no warranty for GDB.  Type "show warranty" for details.
This GDB was configured as "sparc-sun-solaris2.8"...
(no debugging symbols found)
(gdb) set args package
(gdb) run
Starting program: /opt/csw/bin/gmake package
(no debugging symbols found)
warning: Temporarily disabling breakpoints for unloaded shared library "/usr/lib/ld.so.1"
(no debugging symbols found)
(no debugging symbols found)
(no debugging symbols found)
(no debugging symbols found)
(no debugging symbols found)
(no debugging symbols found)
(no debugging symbols found)
(no debugging symbols found)
(no debugging symbols found)
[===== NOW BUILDING:    libntlm-0.4.1   =====]
        [prerequisite] complete for libntlm.
        [fetch] complete for libntlm.
        [checksum] complete for libntlm.
        [extract] complete for libntlm.
        [patch] complete for libntlm.
        [configure] complete for libntlm.
        [build] complete for libntlm.
 ==> Running make check in work/root-xmpp-test.d/libntlm-0.4.1
gmake[1]: Entering directory `/opt/src/csw/lib/libntlm/work/root-xmpp-test.d/libntlm-0.4.1'
Making check in lib
gmake[2]: Entering directory `/opt/src/csw/lib/libntlm/work/root-xmpp-test.d/libntlm-0.4.1/lib'
/opt/csw/bin/gmake  check-am
gmake[3]: Entering directory `/opt/src/csw/lib/libntlm/work/root-xmpp-test.d/libntlm-0.4.1/lib'
gmake[3]: Nothing to be done for `check-am'.
gmake[3]: Leaving directory `/opt/src/csw/lib/libntlm/work/root-xmpp-test.d/libntlm-0.4.1/lib'
gmake[2]: Leaving directory `/opt/src/csw/lib/libntlm/work/root-xmpp-test.d/libntlm-0.4.1/lib'
Making check in tests
gmake[2]: Entering directory `/opt/src/csw/lib/libntlm/work/root-xmpp-test.d/libntlm-0.4.1/tests'
/opt/csw/bin/gmake  check-am
gmake[3]: Entering directory `/opt/src/csw/lib/libntlm/work/root-xmpp-test.d/libntlm-0.4.1/tests'
/opt/csw/bin/gmake  check-TESTS
gmake[4]: Entering directory `/opt/src/csw/lib/libntlm/work/root-xmpp-test.d/libntlm-0.4.1/tests'
PASS: test-des
PASS: test-md4
==================
All 2 tests passed
==================
gmake[4]: Leaving directory `/opt/src/csw/lib/libntlm/work/root-xmpp-test.d/libntlm-0.4.1/tests'
gmake[3]: Leaving directory `/opt/src/csw/lib/libntlm/work/root-xmpp-test.d/libntlm-0.4.1/tests'
gmake[2]: Leaving directory `/opt/src/csw/lib/libntlm/work/root-xmpp-test.d/libntlm-0.4.1/tests'
gmake[2]: Entering directory `/opt/src/csw/lib/libntlm/work/root-xmpp-test.d/libntlm-0.4.1'
/opt/csw/bin/gmake  test_ntlm
gmake[3]: Entering directory `/opt/src/csw/lib/libntlm/work/root-xmpp-test.d/libntlm-0.4.1'
gmake[3]: Leaving directory `/opt/src/csw/lib/libntlm/work/root-xmpp-test.d/libntlm-0.4.1'
/opt/csw/bin/gmake  check-TESTS
gmake[3]: Entering directory `/opt/src/csw/lib/libntlm/work/root-xmpp-test.d/libntlm-0.4.1'
ntlm.h 0.4.1 libntlm 0.4.1
/bin/bash: line 4: 23680 Segmentation Fault      (core dumped) ${dir}$tst
FAIL: test_ntlm
======================================
1 of 1 tests failed
Please report to libntlm@josefsson.org
======================================
gmake[3]: *** [check-TESTS] Error 1
gmake[3]: Leaving directory `/opt/src/csw/lib/libntlm/work/root-xmpp-test.d/libntlm-0.4.1'
gmake[2]: *** [check-am] Error 2
gmake[2]: Leaving directory `/opt/src/csw/lib/libntlm/work/root-xmpp-test.d/libntlm-0.4.1'
gmake[1]: *** [check-recursive] Error 1
gmake[1]: Leaving directory `/opt/src/csw/lib/libntlm/work/root-xmpp-test.d/libntlm-0.4.1'
gmake: *** [test-work/root-xmpp-test.d/libntlm-0.4.1/Makefile] Error 2

Program exited with code 02.