All pastes #923314 Raw Edit

Zeug

public text v1 · immutable
#923314 ·published 2008-02-29 13:27 UTC
rendered paste body
/usr/bin/gcc -Dsyncml_EXPORTS -march=i586 -mtune=i686 -fmessage-length=0 -Wall -D_FORTIFY_SOURCE=2 -fstack-protector -O2 -fPIC -I/usr/src/packages/BUILD/libsyncml0-0.4.6_SVN391 -I/usr/src/packages/BUILD/libsyncml0-0.4.6_SVN391/build -I/usr/include/glib-2.0 -I/usr/lib/glib-2.0/include -I/usr/include/libsoup-2.4 -I/usr/include/libxml2 -o libsyncml/CMakeFiles/syncml.dir/sml_transport.o -c /usr/src/packages/BUILD/libsyncml0-0.4.6_SVN391/libsyncml/sml_transport.c
In file included from /usr/src/packages/BUILD/libsyncml0-0.4.6_SVN391/libsyncml/sml_transport.c:26:
/usr/src/packages/BUILD/libsyncml0-0.4.6_SVN391/libsyncml/transports/http_client_internals.h:28: error: expected specifier-qualifier-list before 'SoupUri'
In file included from /usr/src/packages/BUILD/libsyncml0-0.4.6_SVN391/libsyncml/sml_transport.c:27:
/usr/src/packages/BUILD/libsyncml0-0.4.6_SVN391/libsyncml/transports/http_server_internals.h:27:41: error: libsoup/soup-server-message.h: No such file or directory
In file included from /usr/src/packages/BUILD/libsyncml0-0.4.6_SVN391/libsyncml/sml_transport.c:27:
/usr/src/packages/BUILD/libsyncml0-0.4.6_SVN391/libsyncml/transports/http_server_internals.h:30: error: expected specifier-qualifier-list before 'SoupUri'
/usr/src/packages/BUILD/libsyncml0-0.4.6_SVN391/libsyncml/sml_transport.c: In function 'smlTransportNew':
/usr/src/packages/BUILD/libsyncml0-0.4.6_SVN391/libsyncml/sml_transport.c:473: warning: implicit declaration of function 'smlTransportHttpServerNew'
/usr/src/packages/BUILD/libsyncml0-0.4.6_SVN391/libsyncml/sml_transport.c:477: warning: implicit declaration of function 'smlTransportHttpClientNew'
/usr/src/packages/BUILD/libsyncml0-0.4.6_SVN391/libsyncml/sml_transport.c:488: warning: implicit declaration of function 'smlTransportObexClientNew'
/usr/src/packages/BUILD/libsyncml0-0.4.6_SVN391/libsyncml/sml_transport.c:492: warning: implicit declaration of function 'smlTransportObexServerNew'
/usr/src/packages/BUILD/libsyncml0-0.4.6_SVN391/libsyncml/sml_transport.c: In function 'smlTransportInitialize':
/usr/src/packages/BUILD/libsyncml0-0.4.6_SVN391/libsyncml/sml_transport.c:652: warning: label 'error' defined but not used
make[2]: *** [libsyncml/CMakeFiles/syncml.dir/sml_transport.o] Error 1
make[2]: Leaving directory `/usr/src/packages/BUILD/libsyncml0-0.4.6_SVN391/build'
make[1]: *** [libsyncml/CMakeFiles/syncml.dir/all] Error 2
make[1]: Leaving directory `/usr/src/packages/BUILD/libsyncml0-0.4.6_SVN391/build'
make: *** [all] Error 2
error: Bad exit status from /var/tmp/rpm-tmp.44914 (%build)


RPM build errors:
cannot open Pubkeys index using db3 - No such file or directory (2)
Bad exit status from /var/tmp/rpm-tmp.44914 (%build)
md: stopping all md devices.
xenbus_dev_shutdown: device/console/0: Initialising != Connected, skipping
System halted.