All pastes #922172 Raw Edit

Untitled

public text v1 · immutable
#922172 ·published 2008-02-28 16:55 UTC
rendered paste body
Linking launcher...
Making signal interposition lib...
gcc  -m32 -shared -fPIC \
                         -D_GNU_SOURCE -D_REENTRANT -o libjsig.so /builddir/build/BUILD/icedtea-1.6/openjdk/hotspot/src/os/linux/vm/jsig.c -ldl
if [ -d /builddir/build/BUILD/icedtea-1.6/openjdk/hotspot/agent -a "zero" != "zero" ] ; then \
	   make -f vm.make libsaproc.so; \
	fi
make[6]: Leaving directory `/builddir/build/BUILD/icedtea-1.6/openjdk/build/linux-ppc/hotspot/outputdir/linux_ppc_core/product'
All done.
make[5]: Leaving directory `/builddir/build/BUILD/icedtea-1.6/openjdk/build/linux-ppc/hotspot/outputdir/linux_ppc_core/product'
cd linux_ppc_core/product && ./test_gamma
Error occurred during initialization of VM
java.lang.StackOverflowError
	at sun.misc.SoftCache.<init>(SoftCache.java:160)
	at java.lang.Thread.<clinit>(Thread.java:1606)

Current thread is 1074014784
Dumping core ...
./test_gamma: line 11:  8271 Aborted                 ./${gamma:-gamma} -Xbatch -showversion Queens < /dev/null
make[4]: *** [productcore] Error 134
make[4]: Leaving directory `/builddir/build/BUILD/icedtea-1.6/openjdk/build/linux-ppc/hotspot/outputdir'
make[3]: *** [generic_buildcore] Error 2
make[3]: Leaving directory `/builddir/build/BUILD/icedtea-1.6/openjdk/hotspot/make'
make[2]: *** [productcore] Error 2
make[2]: Leaving directory `/builddir/build/BUILD/icedtea-1.6/openjdk/hotspot/make'
make[1]: *** [hotspot-build] Error 2
make[1]: Leaving directory `/builddir/build/BUILD/icedtea-1.6/openjdk'
make: *** [icedtea] Error 2
error: Bad exit status from /var/tmp/rpm-tmp.94895 (%build)


RPM build errors:
    Bad exit status from /var/tmp/rpm-tmp.94895 (%build)
EXCEPTION: Command failed. See logs for output.
 # bash --login -c 'rpmbuild -bb --target ppc --nodeps //builddir/build/SPECS/java-1.7.0-icedtea.spec'
Traceback (most recent call last):
  File "/usr/lib/python2.4/site-packages/mock/trace_decorator.py", line 70, in trace
    result = func(*args, **kw)
  File "/usr/lib/python2.4/site-packages/mock/util.py", line 287, in do
    raise mock.exception.Error, ("Command failed. See logs for output.\n # %s" % (command,), ret)
Error: Command failed. See logs for output.
 # bash --login -c 'rpmbuild -bb --target ppc --nodeps //builddir/build/SPECS/java-1.7.0-icedtea.spec'
LEAVE do --> EXCEPTION RAISED