All pastes #921980 Raw Edit

Anonymous

public text v1 · immutable
#921980 ·published 2008-02-28 14:48 UTC
rendered paste body
1>------ Build started: Project: Addon, Configuration: Release Win32 ------
1>Compiling...
1>staticinst.cpp
1>..\Lua\staticinst.cpp : error C2471: cannot update program database 'c:\documents and settings\administrator\my documents\infantry projects\infantry server\branches\lua5.1.3-unstable\addon\release\vc90.pdb'
1>Unknown compiler version - please run the configure tests and report the results
1>C:\Documents and Settings\Administrator\My Documents\Infantry Projects\Infantry Server\branches\lua5.1.3-unstable\boost/mpl/aux_/include_preprocessed.hpp(37) : fatal error C1083: Cannot open include file: 'boost/mpl/aux_/preprocessed/plain/list.hpp': No such file or directory
1>Lua.cpp
1>..\Lua\Lua.cpp : error C2471: cannot update program database 'c:\documents and settings\administrator\my documents\infantry projects\infantry server\branches\lua5.1.3-unstable\addon\release\vc90.pdb'
1>Unknown compiler version - please run the configure tests and report the results
1>C:\Documents and Settings\Administrator\My Documents\Infantry Projects\Infantry Server\branches\lua5.1.3-unstable\boost/mpl/aux_/include_preprocessed.hpp(37) : fatal error C1083: Cannot open include file: 'boost/mpl/aux_/preprocessed/plain/list.hpp': No such file or directory
1>Innate.cpp
1>..\Lua\Innate.cpp : error C2471: cannot update program database 'c:\documents and settings\administrator\my documents\infantry projects\infantry server\branches\lua5.1.3-unstable\addon\release\vc90.pdb'
1>Unknown compiler version - please run the configure tests and report the results
1>C:\Documents and Settings\Administrator\My Documents\Infantry Projects\Infantry Server\branches\lua5.1.3-unstable\boost/mpl/aux_/include_preprocessed.hpp(37) : fatal error C1083: Cannot open include file: 'boost/mpl/aux_/preprocessed/plain/list.hpp': No such file or directory
1>Config.cpp
1>..\Lua\Config.cpp : error C2471: cannot update program database 'c:\documents and settings\administrator\my documents\infantry projects\infantry server\branches\lua5.1.3-unstable\addon\release\vc90.pdb'
1>Unknown compiler version - please run the configure tests and report the results
1>C:\Documents and Settings\Administrator\My Documents\Infantry Projects\Infantry Server\branches\lua5.1.3-unstable\boost/mpl/aux_/include_preprocessed.hpp(37) : fatal error C1083: Cannot open include file: 'boost/mpl/aux_/preprocessed/plain/list.hpp': No such file or directory
1>lua_player.cpp
1>.\lua_player.cpp : error C2471: cannot update program database 'c:\documents and settings\administrator\my documents\infantry projects\infantry server\branches\lua5.1.3-unstable\addon\release\vc90.pdb'
1>Unknown compiler version - please run the configure tests and report the results
1>C:\Documents and Settings\Administrator\My Documents\Infantry Projects\Infantry Server\branches\lua5.1.3-unstable\boost/mpl/aux_/include_preprocessed.hpp(37) : fatal error C1083: Cannot open include file: 'boost/mpl/aux_/preprocessed/plain/list.hpp': No such file or directory
1>lua_objects.cpp
1>.\lua_objects.cpp : error C2471: cannot update program database 'c:\documents and settings\administrator\my documents\infantry projects\infantry server\branches\lua5.1.3-unstable\addon\release\vc90.pdb'
1>Unknown compiler version - please run the configure tests and report the results
1>C:\Documents and Settings\Administrator\My Documents\Infantry Projects\Infantry Server\branches\lua5.1.3-unstable\boost/mpl/aux_/include_preprocessed.hpp(37) : fatal error C1083: Cannot open include file: 'boost/mpl/aux_/preprocessed/plain/list.hpp': No such file or directory
1>lua_misc.cpp
1>.\lua_misc.cpp : error C2471: cannot update program database 'c:\documents and settings\administrator\my documents\infantry projects\infantry server\branches\lua5.1.3-unstable\addon\release\vc90.pdb'
1>Unknown compiler version - please run the configure tests and report the results
1>C:\Documents and Settings\Administrator\My Documents\Infantry Projects\Infantry Server\branches\lua5.1.3-unstable\boost/mpl/aux_/include_preprocessed.hpp(37) : fatal error C1083: Cannot open include file: 'boost/mpl/aux_/preprocessed/plain/list.hpp': No such file or directory
1>lua_events.cpp
1>.\lua_events.cpp : error C2471: cannot update program database 'c:\documents and settings\administrator\my documents\infantry projects\infantry server\branches\lua5.1.3-unstable\addon\release\vc90.pdb'
1>Unknown compiler version - please run the configure tests and report the results
1>C:\Documents and Settings\Administrator\My Documents\Infantry Projects\Infantry Server\branches\lua5.1.3-unstable\boost/mpl/aux_/include_preprocessed.hpp(37) : fatal error C1083: Cannot open include file: 'boost/mpl/aux_/preprocessed/plain/list.hpp': No such file or directory
1>lua_arena.cpp
1>.\lua_arena.cpp : error C2471: cannot update program database 'c:\documents and settings\administrator\my documents\infantry projects\infantry server\branches\lua5.1.3-unstable\addon\release\vc90.pdb'
1>Unknown compiler version - please run the configure tests and report the results
1>C:\Documents and Settings\Administrator\My Documents\Infantry Projects\Infantry Server\branches\lua5.1.3-unstable\boost/mpl/aux_/include_preprocessed.hpp(37) : fatal error C1083: Cannot open include file: 'boost/mpl/aux_/preprocessed/plain/list.hpp': No such file or directory
1>arena.cpp
1>.\arena.cpp : error C2471: cannot update program database 'c:\documents and settings\administrator\my documents\infantry projects\infantry server\branches\lua5.1.3-unstable\addon\release\vc90.pdb'
1>Unknown compiler version - please run the configure tests and report the results
1>C:\Documents and Settings\Administrator\My Documents\Infantry Projects\Infantry Server\branches\lua5.1.3-unstable\boost/mpl/aux_/include_preprocessed.hpp(37) : fatal error C1083: Cannot open include file: 'boost/mpl/aux_/preprocessed/plain/list.hpp': No such file or directory
1>DB_Msg.cpp
1>.\DB_Msg.cpp : error C2471: cannot update program database 'c:\documents and settings\administrator\my documents\infantry projects\infantry server\branches\lua5.1.3-unstable\addon\release\vc90.pdb'
1>Unknown compiler version - please run the configure tests and report the results
1>C:\Documents and Settings\Administrator\My Documents\Infantry Projects\Infantry Server\branches\lua5.1.3-unstable\boost/mpl/aux_/include_preprocessed.hpp(37) : fatal error C1083: Cannot open include file: 'boost/mpl/aux_/preprocessed/plain/list.hpp': No such file or directory
1>DB.cpp
1>.\DB.cpp : error C2471: cannot update program database 'c:\documents and settings\administrator\my documents\infantry projects\infantry server\branches\lua5.1.3-unstable\addon\release\vc90.pdb'
1>.\DB.cpp(978) : fatal error C1903: unable to recover from previous error(s); stopping compilation
1>hooks.cpp
1>.\hooks.cpp : error C2471: cannot update program database 'c:\documents and settings\administrator\my documents\infantry projects\infantry server\branches\lua5.1.3-unstable\addon\release\vc90.pdb'
1>Unknown compiler version - please run the configure tests and report the results
1>C:\Documents and Settings\Administrator\My Documents\Infantry Projects\Infantry Server\branches\lua5.1.3-unstable\boost/mpl/aux_/include_preprocessed.hpp(37) : fatal error C1083: Cannot open include file: 'boost/mpl/aux_/preprocessed/plain/list.hpp': No such file or directory
1>Generating Code...
1>Build log was saved at "file://c:\Documents and Settings\Administrator\My Documents\Infantry Projects\Infantry Server\branches\lua5.1.3-unstable\Addon\Release\BuildLog.htm"
1>Addon - 26 error(s), 0 warning(s)
========== Build: 0 succeeded, 1 failed, 0 up-to-date, 0 skipped ==========