All pastes #921953 Raw Edit

Untitled

public text v1 · immutable
#921953 ·published 2008-02-28 14:23 UTC
rendered paste body
1>------ Build started: Project: Addon, Configuration: Release Win32 ------
1>Compiling...
1>staticinst.cpp
1>Unknown compiler version - please run the configure tests and report the results
1>C:\Documents and Settings\Administrator\My Documents\Infantry Projects\Infantry Server\boost/function.hpp(22) : fatal error C1083: Cannot open include file: 'boost/function/detail/prologue.hpp': No such file or directory
1>Lua.cpp
1>Unknown compiler version - please run the configure tests and report the results
1>C:\Documents and Settings\Administrator\My Documents\Infantry Projects\Infantry Server\boost/function.hpp(22) : fatal error C1083: Cannot open include file: 'boost/function/detail/prologue.hpp': No such file or directory
1>Innate.cpp
1>Unknown compiler version - please run the configure tests and report the results
1>C:\Documents and Settings\Administrator\My Documents\Infantry Projects\Infantry Server\boost/function.hpp(22) : fatal error C1083: Cannot open include file: 'boost/function/detail/prologue.hpp': No such file or directory
1>Config.cpp
1>Unknown compiler version - please run the configure tests and report the results
1>C:\Documents and Settings\Administrator\My Documents\Infantry Projects\Infantry Server\boost/function.hpp(22) : fatal error C1083: Cannot open include file: 'boost/function/detail/prologue.hpp': No such file or directory
1>settings.cpp
1>log.cpp
1>Dll.cpp
1>assert.cpp
1>lua_player.cpp
1>Unknown compiler version - please run the configure tests and report the results
1>C:\Documents and Settings\Administrator\My Documents\Infantry Projects\Infantry Server\boost/function.hpp(22) : fatal error C1083: Cannot open include file: 'boost/function/detail/prologue.hpp': No such file or directory
1>lua_objects.cpp
1>Unknown compiler version - please run the configure tests and report the results
1>C:\Documents and Settings\Administrator\My Documents\Infantry Projects\Infantry Server\boost/function.hpp(22) : fatal error C1083: Cannot open include file: 'boost/function/detail/prologue.hpp': No such file or directory
1>lua_misc.cpp
1>Unknown compiler version - please run the configure tests and report the results
1>C:\Documents and Settings\Administrator\My Documents\Infantry Projects\Infantry Server\boost/function.hpp(22) : fatal error C1083: Cannot open include file: 'boost/function/detail/prologue.hpp': No such file or directory
1>lua_events.cpp
1>Unknown compiler version - please run the configure tests and report the results
1>C:\Documents and Settings\Administrator\My Documents\Infantry Projects\Infantry Server\boost/function.hpp(22) : fatal error C1083: Cannot open include file: 'boost/function/detail/prologue.hpp': No such file or directory
1>lua_arena.cpp
1>Unknown compiler version - please run the configure tests and report the results
1>C:\Documents and Settings\Administrator\My Documents\Infantry Projects\Infantry Server\boost/function.hpp(22) : fatal error C1083: Cannot open include file: 'boost/function/detail/prologue.hpp': No such file or directory
1>vehicle.cpp
1>team.cpp
1>item.cpp
1>flag.cpp
1>asset_item.cpp
1>player.cpp
1>Interface.cpp
1>Generating Code...
1>Compiling...
1>arena.cpp
1>Unknown compiler version - please run the configure tests and report the results
1>C:\Documents and Settings\Administrator\My Documents\Infantry Projects\Infantry Server\boost/function.hpp(22) : fatal error C1083: Cannot open include file: 'boost/function/detail/prologue.hpp': No such file or directory
1>csocket.cpp
1>buffer.cpp
1>DB_Security.cpp
1>DB_Msg.cpp
1>Unknown compiler version - please run the configure tests and report the results
1>C:\Documents and Settings\Administrator\My Documents\Infantry Projects\Infantry Server\boost/function.hpp(22) : fatal error C1083: Cannot open include file: 'boost/function/detail/prologue.hpp': No such file or directory
1>DB.cpp
1>.\DB.cpp : error C2471: cannot update program database 'c:\documents and settings\administrator\my documents\infantry projects\infantry server\addon\release\vc90.pdb'
1>.\DB.cpp(978) : fatal error C1903: unable to recover from previous error(s); stopping compilation
1>hooks.cpp
1>.\hooks.cpp : error C2471: cannot update program database 'c:\documents and settings\administrator\my documents\infantry projects\infantry server\addon\release\vc90.pdb'
1>Unknown compiler version - please run the configure tests and report the results
1>C:\Documents and Settings\Administrator\My Documents\Infantry Projects\Infantry Server\boost/function.hpp(22) : fatal error C1083: Cannot open include file: 'boost/function/detail/prologue.hpp': No such file or directory
1>Generating Code...
1>Build log was saved at "file://c:\Documents and Settings\Administrator\My Documents\Infantry Projects\Infantry Server\Addon\Release\BuildLog.htm"
1>Addon - 15 error(s), 0 warning(s)
========== Build: 0 succeeded, 1 failed, 0 up-to-date, 0 skipped ==========