All pastes #920553 Raw Edit

Mine

public text v1 · immutable
#920553 ·published 2008-02-27 14:21 UTC
rendered paste body
[root@resolute unix]# rpmbuild -ba /usr/src/redhat/SPECS/tcl.spec
Executing(%prep): /bin/sh -e /var/tmp/rpm-tmp.65896
+ umask 022
+ cd /usr/src/redhat/BUILD
+ cd /usr/src/redhat/BUILD
+ /bin/mkdir -p tcl-8.4.13
+ cd tcl-8.4.13
+ /bin/gzip -dc /usr/src/redhat/SOURCES/tcl8.4.13-src.tar.gz
+ tar -xf -
+ STATUS=0
+ '[' 0 -ne 0 ']'
+ /bin/gzip -dc /usr/src/redhat/SOURCES/tk8.4.13-src.tar.gz
+ tar -xf -
+ STATUS=0
+ '[' 0 -ne 0 ']'
++ /usr/bin/id -u
+ '[' 0 = 0 ']'
+ /bin/chown -Rhf root .
++ /usr/bin/id -u
+ '[' 0 = 0 ']'
+ /bin/chgrp -Rhf root .
+ /bin/chmod -Rf a+rX,u+w,g-w,o-w .
+ cd tcl8.4.13
+ echo 'Patch #1 (tcl-8.3.5-tclm4-soname.patch):'
Patch #1 (tcl-8.3.5-tclm4-soname.patch):
+ patch -p1 -b --suffix .1-soname -s
+ echo 'Patch #2 (tcl-8.4.5-lib-perm.patch):'
Patch #2 (tcl-8.4.5-lib-perm.patch):
+ patch -p1 -b --suffix .2-ro-lib -s
+ echo 'Patch #3 (tcl8.3.5-tclConfig-package-path-90160.patch):'
Patch #3 (tcl8.3.5-tclConfig-package-path-90160.patch):
+ patch -p1 -b --suffix .3-pkgpath -s
+ echo 'Patch #4 (tcl-8.4-no_rpath.patch):'
Patch #4 (tcl-8.4-no_rpath.patch):
+ patch -p1 -b --suffix .4-rpath -s
+ echo 'Patch #5 (tcl-8.4.13-autoconf.patch):'
Patch #5 (tcl-8.4.13-autoconf.patch):
+ patch -p1 -b --suffix .5-ac213 -s
+ pushd ..
/usr/src/redhat/BUILD/tcl-8.4.13 /usr/src/redhat/BUILD/tcl-8.4.13/tcl8.4.13
+ echo 'Patch #6 (tcl-8.4.13-cflags.patch):'
Patch #6 (tcl-8.4.13-cflags.patch):
+ patch -p1 -b --suffix .6-cflags -s
+ popd
/usr/src/redhat/BUILD/tcl-8.4.13/tcl8.4.13
+ cd unix
+ autoconf
+ exit 0
Executing(%build): /bin/sh -e /var/tmp/rpm-tmp.10448
+ umask 022
+ cd /usr/src/redhat/BUILD
+ cd tcl-8.4.13
+ cd tcl8.4.13/unix
+ CFLAGS='-O2 -g -march=i386 -mcpu=i686'
+ export CFLAGS
+ CXXFLAGS='-O2 -g -march=i386 -mcpu=i686'
+ export CXXFLAGS
+ FFLAGS='-O2 -g -march=i386 -mcpu=i686'
+ export FFLAGS
+ ./configure --host=i686-redhat-linux-gnu --build=i686-redhat-linux-gnu --target=i386-redhat-linux --program-prefix= --prefix=/usr --exec-prefix=/usr --bindir=/usr/bin --sbindir=/usr/sbin --sysconfdir=/etc --datadir=/usr/share --includedir=/usr/include --libdir=/usr/lib --libexecdir=/usr/libexec --localstatedir=/var --sharedstatedir=/usr/com --mandir=/usr/share/man --infodir=/usr/share/info
checking whether to use symlinks for manpages... no
checking whether to compress the manpages... no
checking whether to add a package name suffix for the manpages... no
checking for i686-redhat-linux-gnu-gcc... no
checking for gcc... gcc
checking for C compiler default output file name... a.out
checking whether the C compiler works... yes
checking whether we are cross compiling... no
checking for suffix of executables... 
checking for suffix of object files... o
checking whether we are using the GNU C compiler... yes
checking whether gcc accepts -g... yes
checking for gcc option to accept ANSI C... none needed
checking how to run the C preprocessor... gcc -E
checking for egrep... grep -E
checking for ANSI C header files... yes
checking for sys/types.h... yes
checking for sys/stat.h... yes
checking for stdlib.h... yes
checking for string.h... yes
checking for memory.h... yes
checking for strings.h... yes
checking for inttypes.h... yes
checking for stdint.h... yes
checking for unistd.h... yes
checking dirent.h... yes
checking errno.h usability... yes
checking errno.h presence... yes
checking for errno.h... yes
checking float.h usability... yes
checking float.h presence... yes
checking for float.h... yes
checking values.h usability... yes
checking values.h presence... yes
checking for values.h... yes
checking limits.h usability... yes
checking limits.h presence... yes
checking for limits.h... yes
checking for stdlib.h... (cached) yes
checking for string.h... (cached) yes
checking sys/wait.h usability... yes
checking sys/wait.h presence... yes
checking for sys/wait.h... yes
checking dlfcn.h usability... yes
checking dlfcn.h presence... yes
checking for dlfcn.h... yes
checking for unistd.h... (cached) yes
checking sys/param.h usability... yes
checking sys/param.h presence... yes
checking for sys/param.h... yes
checking if the compiler understands -pipe... yes
checking for building with threads... no (default)
checking for sin... no
checking for main in -lieee... yes
checking for main in -linet... no
checking net/errno.h usability... no
checking net/errno.h presence... no
checking for net/errno.h... no
checking for connect... yes
checking for gethostbyname... yes
checking how to build libraries... shared
checking for i686-redhat-linux-gnu-ranlib... no
checking for ranlib... ranlib
checking if 64bit support is requested... no
checking if 64bit Sparc VIS support is requested... no
checking system version... Linux-2.6.18-53.el5PAE
checking for dlopen in -ldl... yes
checking for ar... ar
checking for build with symbols... no
checking for required early compiler flags...  _LARGEFILE64_SOURCE
checking for 64-bit integer type... long long
checking for struct dirent64... no
checking for struct stat64... yes
checking for open64... yes
checking for lseek64... yes
checking for off64_t... yes
checking whether byte ordering is bigendian... no
checking for getcwd... yes
checking for opendir... yes
checking for strstr... yes
checking for strtol... yes
checking for strtoll... yes
checking for strtoull... yes
checking for tmpnam... yes
checking for waitpid... yes
checking for strerror... yes
checking for getwd... yes
checking for wait3... yes
checking for uname... yes
checking for realpath... yes
checking sys/modem.h usability... no
checking sys/modem.h presence... no
checking for sys/modem.h... no
checking termios vs. termio vs. sgtty... termios
checking for fd_set in sys/types... yes
checking whether struct tm is in sys/time.h or time.h... time.h
checking sys/time.h usability... yes
checking sys/time.h presence... yes
checking for sys/time.h... yes
checking whether time.h and sys/time.h may both be included... yes
checking for struct tm.tm_zone... yes
checking for gmtime_r... yes
checking for localtime_r... yes
checking tm_tzadj in struct tm... no
checking tm_gmtoff in struct tm... yes
checking long timezone variable... yes
checking for struct stat.st_blksize... yes
checking for fstatfs... yes
checking for working memcmp... yes
checking for memmove... yes
checking proper strstr implementation... ok
checking for strtoul... yes
checking proper strtoul implementation... ok
checking for strtod... yes
checking proper strtod implementation... ok
checking for strtod... (cached) yes
checking for Solaris2.4/Tru64 strtod bugs... ok
checking for mode_t... yes
checking for pid_t... yes
checking for size_t... yes
checking for uid_t in sys/types.h... yes
checking for socklen_t... yes
checking for opendir... (cached) yes
checking union wait... yes
checking for strncasecmp... yes
checking for BSDgettimeofday... no
checking for gettimeofday... yes
checking for gettimeofday declaration... present
checking whether char is unsigned... no
checking signed char declarations... yes
checking for a putenv() that copies the buffer... no
checking langinfo.h usability... yes
checking langinfo.h presence... yes
checking for langinfo.h... yes
checking whether to use nl_langinfo... yes
checking for fts... no
checking sys/ioctl.h usability... yes
checking sys/ioctl.h presence... yes
checking for sys/ioctl.h... yes
checking sys/filio.h usability... no
checking sys/filio.h presence... no
checking for sys/filio.h... no
checking system version... (cached) Linux-2.6.18-53.el5PAE
checking FIONBIO vs. O_NONBLOCK for nonblocking I/O... O_NONBLOCK
configure: creating ./config.status
config.status: creating Makefile
config.status: creating dltest/Makefile
config.status: creating tclConfig.sh
+ make -j2 TCL_LIBRARY=/usr/share/tcl8.4
gcc -pipe -c -O2 -O2 -g -march=i386 -mcpu=i686 -DTCL_DBGX= -Wall -Wno-implicit-int -fno-strict-aliasing -fPIC -I/usr/src/redhat/BUILD/tcl-8.4.13/tcl8.4.13/unix/../generic -I/usr/src/redhat/BUILD/tcl-8.4.13/tcl8.4.13/unix -DPACKAGE_NAME=\"\" -DPACKAGE_TARNAME=\"\" -DPACKAGE_VERSION=\"\" -DPACKAGE_STRING=\"\" -DPACKAGE_BUGREPORT=\"\" -DSTDC_HEADERS=1 -DHAVE_SYS_TYPES_H=1 -DHAVE_SYS_STAT_H=1 -DHAVE_STDLIB_H=1 -DHAVE_STRING_H=1 -DHAVE_MEMORY_H=1 -DHAVE_STRINGS_H=1 -DHAVE_INTTYPES_H=1 -DHAVE_STDINT_H=1 -DHAVE_UNISTD_H=1 -DHAVE_LIMITS_H=1 -DHAVE_UNISTD_H=1 -DHAVE_SYS_PARAM_H=1 -DPEEK_XCLOSEIM=1 -D_LARGEFILE64_SOURCE=1 -DTCL_WIDE_INT_TYPE=long\ long -DHAVE_STRUCT_STAT64=1 -DHAVE_OPEN64=1 -DHAVE_LSEEK64=1 -DHAVE_TYPE_OFF64_T=1 -DHAVE_GETCWD=1 -DHAVE_OPENDIR=1 -DHAVE_STRSTR=1 -DHAVE_STRTOL=1 -DHAVE_STRTOLL=1 -DHAVE_STRTOULL=1 -DHAVE_TMPNAM=1 -DHAVE_WAITPID=1 -DUSE_TERMIOS=1 -DHAVE_SYS_TIME_H=1 -DTIME_WITH_SYS_TIME=1 -DHAVE_STRUCT_TM_TM_ZONE=1 -DHAVE_TM_ZONE=1 -DHAVE_GMTIME_R=1 -DHAVE_LOCALTIME_R=1 -DHAVE_TM_GMTOFF=1 -DHAVE_TIMEZONE_VAR=1 -DHAVE_STRUCT_STAT_ST_BLKSIZE=1 -DHAVE_ST_BLKSIZE=1 -DHAVE_SIGNED_CHAR=1 -DHAVE_LANGINFO=1 -DHAVE_SYS_IOCTL_H=1         -DTCL_SHLIB_EXT=\".so\"  -DTCL_LIBRARY=\"/usr/share/tcl8.4\" \
                -DTCL_PACKAGE_PATH="\"/usr/lib /usr/share\"" \
                /usr/src/redhat/BUILD/tcl-8.4.13/tcl8.4.13/unix/tclUnixInit.c
`-mcpu=' is deprecated. Use `-mtune=' or '-march=' instead.
rm -f libtcl8.4.so
gcc -pipe -O2 -O2 -g -march=i386 -mcpu=i686 -DTCL_DBGX= -shared -Wl,-soname,libtcl8.4.so -o libtcl8.4.so regcomp.o regexec.o regfree.o regerror.o tclAlloc.o tclAsync.o tclBasic.o tclBinary.o tclCkalloc.o tclClock.o tclCmdAH.o tclCmdIL.o tclCmdMZ.o tclCompCmds.o tclCompExpr.o tclCompile.o tclDate.o tclEncoding.o tclEnv.o tclEvent.o tclExecute.o tclFCmd.o tclFileName.o tclGet.o tclHash.o tclHistory.o tclIndexObj.o tclInterp.o tclIO.o tclIOCmd.o tclIOGT.o tclIOSock.o tclIOUtil.o tclLink.o tclListObj.o tclLiteral.o tclLoad.o tclMain.o tclNamesp.o tclNotify.o tclObj.o tclPanic.o tclParse.o tclParseExpr.o tclPipe.o tclPkg.o tclPosixStr.o tclPreserve.o tclProc.o tclRegexp.o tclResolve.o tclResult.o tclScan.o tclStringObj.o tclThread.o tclThreadAlloc.o tclThreadJoin.o tclStubInit.o tclStubLib.o tclTimer.o tclUtf.o tclUtil.o tclVar.o tclUnixChan.o tclUnixEvent.o tclUnixFCmd.o tclUnixFile.o tclUnixPipe.o tclUnixSock.o tclUnixTime.o tclUnixInit.o tclUnixThrd.o  tclUnixNotfy.o  tclLoadDl.o  -ldl  -lieee -lm   
gcc -pipe -O2 -O2 -g -march=i386 -mcpu=i686 -DTCL_DBGX=   -Wl,--export-dynamic tclAppInit.o -L/usr/src/redhat/BUILD/tcl-8.4.13/tcl8.4.13/unix -ltcl8.4 -ldl  -lieee -lm \
                 -o tclsh
+ make test
gcc -pipe -c -O2 -O2 -g -march=i386 -mcpu=i686 -DTCL_DBGX= -Wall -Wno-implicit-int -fno-strict-aliasing -fPIC -I/usr/src/redhat/BUILD/tcl-8.4.13/tcl8.4.13/unix/../generic -I/usr/src/redhat/BUILD/tcl-8.4.13/tcl8.4.13/unix -DPACKAGE_NAME=\"\" -DPACKAGE_TARNAME=\"\" -DPACKAGE_VERSION=\"\" -DPACKAGE_STRING=\"\" -DPACKAGE_BUGREPORT=\"\" -DSTDC_HEADERS=1 -DHAVE_SYS_TYPES_H=1 -DHAVE_SYS_STAT_H=1 -DHAVE_STDLIB_H=1 -DHAVE_STRING_H=1 -DHAVE_MEMORY_H=1 -DHAVE_STRINGS_H=1 -DHAVE_INTTYPES_H=1 -DHAVE_STDINT_H=1 -DHAVE_UNISTD_H=1 -DHAVE_LIMITS_H=1 -DHAVE_UNISTD_H=1 -DHAVE_SYS_PARAM_H=1 -DPEEK_XCLOSEIM=1 -D_LARGEFILE64_SOURCE=1 -DTCL_WIDE_INT_TYPE=long\ long -DHAVE_STRUCT_STAT64=1 -DHAVE_OPEN64=1 -DHAVE_LSEEK64=1 -DHAVE_TYPE_OFF64_T=1 -DHAVE_GETCWD=1 -DHAVE_OPENDIR=1 -DHAVE_STRSTR=1 -DHAVE_STRTOL=1 -DHAVE_STRTOLL=1 -DHAVE_STRTOULL=1 -DHAVE_TMPNAM=1 -DHAVE_WAITPID=1 -DUSE_TERMIOS=1 -DHAVE_SYS_TIME_H=1 -DTIME_WITH_SYS_TIME=1 -DHAVE_STRUCT_TM_TM_ZONE=1 -DHAVE_TM_ZONE=1 -DHAVE_GMTIME_R=1 -DHAVE_LOCALTIME_R=1 -DHAVE_TM_GMTOFF=1 -DHAVE_TIMEZONE_VAR=1 -DHAVE_STRUCT_STAT_ST_BLKSIZE=1 -DHAVE_ST_BLKSIZE=1 -DHAVE_SIGNED_CHAR=1 -DHAVE_LANGINFO=1 -DHAVE_SYS_IOCTL_H=1         -DTCL_SHLIB_EXT=\".so\"  \
                -DTCL_BUILDTIME_LIBRARY="\"/usr/src/redhat/BUILD/tcl-8.4.13/tcl8.4.13/library\"" \
                -DTCL_TEST /usr/src/redhat/BUILD/tcl-8.4.13/tcl8.4.13/unix/tclAppInit.c
`-mcpu=' is deprecated. Use `-mtune=' or '-march=' instead.
rm -f tclTestInit.o
mv tclAppInit.o tclTestInit.o
make tcltest-real LIB_RUNTIME_DIR=`pwd`
make[1]: Entering directory `/usr/src/redhat/BUILD/tcl-8.4.13/tcl8.4.13/unix'
gcc -pipe -O2 -O2 -g -march=i386 -mcpu=i686 -DTCL_DBGX=   -Wl,--export-dynamic tclTestInit.o tclTest.o tclTestObj.o tclTestProcBodyObj.o tclThreadTest.o    tclUnixTest.o -L/usr/src/redhat/BUILD/tcl-8.4.13/tcl8.4.13/unix -ltcl8.4 -ldl  -lieee -lm \
                 -o tcltest
make[1]: Leaving directory `/usr/src/redhat/BUILD/tcl-8.4.13/tcl8.4.13/unix'
LD_LIBRARY_PATH=`pwd`:${LD_LIBRARY_PATH}; export LD_LIBRARY_PATH; \
        TCL_LIBRARY="/usr/src/redhat/BUILD/tcl-8.4.13/tcl8.4.13/library"; export TCL_LIBRARY; \
        ./tcltest /usr/src/redhat/BUILD/tcl-8.4.13/tcl8.4.13/unix/../tests/all.tcl  
Tests running in interp:  /usr/src/redhat/BUILD/tcl-8.4.13/tcl8.4.13/unix/tcltest
Tests located in:  /usr/src/redhat/BUILD/tcl-8.4.13/tcl8.4.13/tests
Tests running in:  /usr/src/redhat/BUILD/tcl-8.4.13/tcl8.4.13/unix
Temporary files stored in /usr/src/redhat/BUILD/tcl-8.4.13/tcl8.4.13/unix
Test files run in separate interpreters
Running tests that match:  *
Skipping test files that match:  l.*.test
Only running test files that match:  *.test
Tests began at Wed Feb 27 09:10:49 AM EST 2008
append.test
appendComp.test
assocd.test
async.test
autoMkindex.test
basic.test
binary.test
case.test
clock.test
cmdAH.test
cmdIL.test
cmdInfo.test
cmdMZ.test
compExpr-old.test
compExpr.test
compile.test
concat.test
dcall.test
dstring.test
encoding.test
env.test
error.test
eval.test
event.test
exec.test
execute.test
expr-old.test
expr.test
fCmd.test
fileName.test
fileSystem.test
for-old.test
for.test
foreach.test
format.test
get.test
history.test
http.test

==== http-3.3 http::geturl FAILED
==== Contents of test case:

    set token [http::geturl $url]
    http::data $token

---- Test generated error; Return code was: 1
---- Return code should have been one of: 0 2
---- errorInfo: couldn't open socket: connection timed out
    while executing
"http::geturl $url"
    invoked from within
"set token [http::geturl $url]"
    ("uplevel" body line 2)
    invoked from within
"uplevel 1 $script"
---- errorCode: NONE
==== http-3.3 FAILED
==== http-3.4 http::geturl FAILED
==== Contents of test case:

    set token [http::geturl $url]
    http::data $token

---- Test generated error; Return code was: 1
---- Return code should have been one of: 0 2
---- errorInfo: couldn't open socket: connection timed out
    while executing
"http::geturl $url"
    invoked from within
"set token [http::geturl $url]"
    ("uplevel" body line 2)
    invoked from within
"uplevel 1 $script"
---- errorCode: NONE
==== http-3.4 FAILED