rendered paste bodysh-3.1$ bitbake opie-image
NOTE: Psyco JIT Compiler (http://psyco.sf.net) not available. Install it to increase performance.
NOTE: Handling BitBake files: - (4975/4975) [100 %]
NOTE: Parsing finished. 4743 cached, 0 parsed, 232 skipped, 0 masked.
NOTE: build 200802271209: started
OE Build Configuration:
BB_VERSION = "1.8.9"
OE_REVISION = "5bdc75c29fa81a2a02601bf8d748c2d93f0e2b2b"
TARGET_ARCH = "arm"
TARGET_OS = "linux"
MACHINE = "simpad"
DISTRO = "angstrom"
DISTRO_VERSION = "2007.12-r6"
TARGET_FPU = "soft"
NOTE: Resolving missing task queue dependencies
NOTE: preferred version 2.5 of glibc not available (for item virtual/arm-angstrom-linux-libc-for-gcc)
NOTE: Preparing runqueue
NOTE: Executing runqueue
NOTE: Running task 1392 of 2287 (ID: 1901, /home/nice/SlackPAD/oe/org.openembedded.angstrom-2007.12-stable/packages/qte/qte-mt_2.3.10.bb, do_compile)
NOTE: package qte-mt-2.3.10: started
NOTE: package qte-mt-2.3.10-r25: task do_compile: started
ERROR: function do_compile failed
ERROR: log data follows (/home/nice/SlackPAD/oe/tmp/work/arm-oabi-angstrom-linux/qte-mt-2.3.10-r25/temp/log.do_compile.26198)
| NOTE: make -j 4 -e symlinks
| NOTE: make -j 4 -e src-mt sub-src
| make -f src-mt.mk
| make[1]: Entering directory `/home/nice/SlackPAD/oe/tmp/work/arm-oabi-angstrom-linux/qte-mt-2.3.10-r25/qt-2.3.10'
| cd src; make 'QT_THREAD_SUFFIX=-mt' 'QT_LFLAGS_MT=$(SYSCONF_LFLAGS_THREAD) $(SYSCONF_LIBS_THREAD)' 'QT_CXX_MT=$(SYSCONF_CXXFLAGS_THREAD) -DQT_THREAD_SUPPORT' 'QT_C_MT=$(SYSCONF_CFLAGS_THREAD) -DQT_THREAD_SUPPORT'
| make[2]: Entering directory `/home/nice/SlackPAD/oe/tmp/work/arm-oabi-angstrom-linux/qte-mt-2.3.10-r25/qt-2.3.10/src'
| arm-linux-g++ -D_REENTRANT -DQT_THREAD_SUPPORT -c -I/home/nice/SlackPAD/oe/tmp/work/arm-oabi-angstrom-linux/qte-mt-2.3.10-r25/qt-2.3.10/include -pipe -DQWS -fno-exceptions -fno-rtti -O2 -Wall -W -DNO_DEBUG -fPIC -DQT_NO_IMAGEIO_MNG -DQT_NO_VNC -DQT_NO_QWS_SNAP -DQT_NO_QWS_VOODOO3 -DQT_NO_QWS_MACH64 -DQT_NO_QWS_MATROX -DQT_NO_QWS_VNC -DQT_NO_QWS_VGA_16 -DQT_NO_QWS_DEPTH_4 -DQT_NO_QWS_DEPTH_24 -DQT_NO_QWS_VFB -DQT_BUILTIN_GIF_READER=1 -DQT_NO_IMAGEIO_MNG -DQT_NO_SM_SUPPORT -DQT_NO_XKB -I3rdparty/kernel -I3rdparty/tools -o allmoc.o allmoc.cpp
| make[2]: arm-linux-g++: Command not found
| make[2]: *** [allmoc.o] Error 127
| make[2]: Leaving directory `/home/nice/SlackPAD/oe/tmp/work/arm-oabi-angstrom-linux/qte-mt-2.3.10-r25/qt-2.3.10/src'
| make[1]: *** [src-mt] Error 2
| make[1]: Leaving directory `/home/nice/SlackPAD/oe/tmp/work/arm-oabi-angstrom-linux/qte-mt-2.3.10-r25/qt-2.3.10'
| make: *** [src-mt] Error 2
| FATAL: oe_runmake failed
NOTE: Task failed: /home/nice/SlackPAD/oe/tmp/work/arm-oabi-angstrom-linux/qte-mt-2.3.10-r25/temp/log.do_compile.26198
NOTE: package qte-mt-2.3.10-r25: task do_compile: failed
ERROR: TaskFailed event exception, aborting
NOTE: package qte-mt-2.3.10: failed
ERROR: Build of /home/nice/SlackPAD/oe/org.openembedded.angstrom-2007.12-stable/packages/qte/qte-mt_2.3.10.bb do_compile failed
ERROR: Task 1901 (/home/nice/SlackPAD/oe/org.openembedded.angstrom-2007.12-stable/packages/qte/qte-mt_2.3.10.bb, do_compile) failed
NOTE: Tasks Summary: Attempted 1391 tasks of which 1391 didn't need to be rerun and 1 failed.
ERROR: '/home/nice/SlackPAD/oe/org.openembedded.angstrom-2007.12-stable/packages/qte/qte-mt_2.3.10.bb' failed