rendered paste bodybash-3.00# gmake
../../gar.mk:72: warning: overriding commands for target `work/root-xmpp-test.d'
../../gar.pkg.mk:111: warning: ignoring old commands for target `work/root-xmpp-test.d'
[===== NOW BUILDING: libntlm-0.4.1 =====]
ginstall -d cookies/root-xmpp-test.d
ginstall -d download
ginstall -d download/partial
==> Verifying for installed package CSWgmake: installed
==> Verifying for installed package CSWgtar: installed
==> Verifying for installed package CSWggrep: installed
==> Verifying for installed package CSWdiffutils: installed
==> Verifying for installed package CSWgfile: installed
==> Verifying for installed package CSWtextutils: installed
==> Verifying for installed package CSWwget: installed
==> Verifying for installed package CSWfindutils: installed
==> Verifying for installed package CSWgsed: installed
==> Verifying for installed package CSWgawk: installed
==> Verifying for installed package CSWbzip2: installed
==> Verifying for installed package CSWlftp: installed
[prerequisite] complete for libntlm.
==> Grabbing download/libntlm-0.4.1.tar.gz
==> Trying file//files/libntlm-0.4.1.tar.gz
../../gar.mk:72: warning: overriding commands for target `work/root-xmpp-test.d'
../../gar.pkg.mk:111: warning: ignoring old commands for target `work/root-xmpp-test.d'
gmake[1]: *** [file//files/libntlm-0.4.1.tar.gz] Error 255
==> Trying file///export/medusa/src/libntlm-0.4.1.tar.gz
../../gar.mk:72: warning: overriding commands for target `work/root-xmpp-test.d'
../../gar.pkg.mk:111: warning: ignoring old commands for target `work/root-xmpp-test.d'
gmake[1]: *** [file///export/medusa/src/libntlm-0.4.1.tar.gz] Error 255
==> Trying http//josefsson.org/libntlm/releases/libntlm-0.4.1.tar.gz
../../gar.mk:72: warning: overriding commands for target `work/root-xmpp-test.d'
../../gar.pkg.mk:111: warning: ignoring old commands for target `work/root-xmpp-test.d'
--2008-02-26 20:48:23-- http://josefsson.org/libntlm/releases/libntlm-0.4.1.tar.gz
Resolving svn... failed: node name or service name not known.
wget: unable to resolve host address `svn'
gmake[1]: *** [http//josefsson.org/libntlm/releases/libntlm-0.4.1.tar.gz] Error 1
(!!!) Failed to download download/libntlm-0.4.1.tar.gz!
gmake: *** [download/libntlm-0.4.1.tar.gz] Error 255