build:
[echo] Build Directory is /home/sdague/code/opensim-threadpool/OpenSim/Framework/Statistics/bin/Debug
[mkdir] Creating directory '/home/sdague/code/opensim-threadpool/OpenSim/Framework/Statistics/bin/Debug'.
[csc] Compiling 4 files to '/home/sdague/code/opensim-threadpool/OpenSim/Framework/Statistics/bin/Debug/OpenSim.Framework.Statistics.dll'.
[csc] /home/sdague/code/opensim-threadpool/OpenSim/Framework/Statistics/SimExtraStatsReporter.cs(34,36): error CS0234: The type or namespace name `Interfaces' does not exist in the namespace `OpenSim.Framework.Statistics'. Are you missing an assembly reference?
[csc] /home/sdague/code/opensim-threadpool/OpenSim/Framework/Statistics/SimExtraStatsReporter.cs(34,1): error CS0246: The type or namespace name `Statistics.Interfaces' could not be found. Are you missing a using directive or an assembly reference?
[csc] /home/sdague/code/opensim-threadpool/OpenSim/Framework/Statistics/SimExtraStatsReporter.cs(79,67): error CS0246: The type or namespace name `IPullStatsProvider' could not be found. Are you missing a using directive or an assembly reference?
[csc] /home/sdague/code/opensim-threadpool/OpenSim/Framework/Statistics/SimExtraStatsReporter.cs(141,17): error CS0246: The type or namespace name `IPullStatsProvider' could not be found. Are you missing a using directive or an assembly reference?
[csc] /home/sdague/code/opensim-threadpool/OpenSim/Framework/Statistics/SimExtraStatsReporter.cs(143,41): error CS0246: The type or namespace name `IPullStatsProvider' could not be found. Are you missing a using directive or an assembly reference?
[csc] /home/sdague/code/opensim-threadpool/OpenSim/Framework/Statistics/SimExtraStatsReporter.cs(34,36): error CS0234: The type or namespace name `Interfaces' does not exist in the namespace `OpenSim.Framework.Statistics'. Are you missing an assembly reference?
[csc] /home/sdague/code/opensim-threadpool/OpenSim/Framework/Statistics/SimExtraStatsReporter.cs(34,1): error CS0246: The type or namespace name `Statistics.Interfaces' could not be found. Are you missing a using directive or an assembly reference?
[csc] Compilation failed: 7 error(s), 0 warnings